{"text_format":"1","workbook":"xlsx","n_sheets":9,"sheets":["Directions","1-Cover","2-Constants","3-H&H","4-Soil","5-Wood","6-Single Log Design","7-Notation","Anchors"],"not_rendered":{"charts":1,"images":9,"macros":1,"external_links":0,"defined_names":43,"comments":6,"pivot_tables":0},"unopened":[],"bounds":{"document_bytes":16777216,"sheet_cells":100000,"rows_first":2000,"rows_last":500,"rows_between":2000,"halvings":0,"cell_chars":16384,"cell_head_chars":4096},"cells_cut":0,"cells_raw":0,"read":"whole","date_system":"1900"}

{"sheet":"Directions","index":0,"n_rows":125,"n_cols":16,"rows_kept":125,"cut":false,"hidden":false,"merged":[[82,11,83,15],[88,11,96,15],[0,0,0,9],[2,0,2,9],[4,0,4,9],[5,0,12,9],[13,0,13,9],[108,0,111,9],[90,1,99,9],[83,1,89,9],[78,1,80,9],[100,1,100,9],[101,1,104,9],[105,0,105,9],[106,0,107,9],[124,0,124,3],[53,0,54,9],[56,0,57,9],[59,0,63,9],[50,0,51,9],[65,0,66,9],[116,0,117,9],[120,0,120,9],[121,0,121,9],[122,0,122,9],[123,0,123,9],[73,0,77,9],[81,1,82,9],[112,0,113,9],[68,0,69,9],[119,0,119,9]]}
["Directions for LW Stability Analysis Tool"]
[]
["This design tool may be used by practitioners if they cite the developer on each sheet."]
[]
["Disclaimer:"]
["This Microsoft Excel 2010 spreadsheet tool is provided free of charge.  Use this tool at your own risk.  In offering this tool, the author and Colorado State University do not accept any responsibility or liability for the tool's use by third parties.  This tool has specific uses and limits of applicability.  Design practitioners shall take full responsibility for the final large wood structure design and performance.  Designers are expected to verify the calculated values and validity of the design method.  Designers should be qualified to work in river environments, and depending on the State, they may be required to be licensed as a professional engineer to design large wood structures.  You cannot be sure the tool is authentic and unmolested unless downloaded from the following website:  "]
[]
[]
[]
[]
[]
[]
[]
["www.engr.colostate.edu/~bbledsoe/streamtools/"]
[]
["DATA INPUT"]
[]
["Order of Input"]
[null,"Update the worksheets from \"left to right\""]
[null,"Update the spreadsheet cells from \"left to right\" and \"top to bottom\""]
[]
["IMPORTANT - User should only edit the following cells:"]
[]
[null,"Cell Format",null,"Directions"]
[null,"Dropdown List",null,"Select value from dropdown list"]
[]
[null,"User Input",null,"Type value into cell"]
[]
[null,"User Verify",null,"Verify value in cell (edit if necessary)"]
[]
["User should verify, but not edit the following cells because these cells contain formulas or headings:"]
[]
[null,"Cell Format",null,"Directions"]
[null,"Heading",null,"Table Heading (Scroll over sample heading for description of comments)"]
[]
[null,"Automatic Value",null,"Verify value in cell which is automatically calculated by formulas"]
[]
[null,"Key Value",null,"Verify value of force calculation"]
[]
[null,"Solution",null,"Verify value of force balance or factor of safety calculation"]
[]
[null,"Background Value",null,"Optional - Verify value of background calculation (outside of print area)"]
[]
["The \"Single Log\" and \"Multi-Log\" spreadsheets have several built-in error messages (in column 'K'):"]
[]
[null,"Error Message"]
[null,"\"CHECK\"",null,"Prompts user to check a specific input"]
[]
[null,"\"ERROR\"",null,"Prompts user to change a specific input"]
[]
["User Input Note 1 - Several worksheets have a built in \"clear inputs\" button linked to a macro (these are the only macros built into the tool).  Be aware that you can't undo the \"clear input\" command."]
[]
[]
["User Input Note 2 - User may enter a custom \"bank soil type\", \"wood species\", or \"anchor type\" by scrolling over to the right to find the lookup table and editing the \"custom\" cells."]
[]
[]
["User Input Note 3 - The spreadsheet is not locked, and therefore every cell can be manually edited.  However, the user is encouraged to exercise caution to avoid unintended consequences due to reference formulas."]
[]
[]
["User Input Note 4 - User should also be very careful when removing or adding cells (at least scroll over and down to see what other cells may be impacted).  Hiding unused rows or columns is recommended instead of deleting them.  If the user needs to add cells on the \"Single Log Design\" spreadsheet, they should add a row of cells for all columns between 'A' and 'J'.  Important: Adding cells will break the code in the \"Clear Inputs\" macro, and cause it to clear the wrong cells."]
[]
[]
[]
[]
[]
["User Input Note 5 - To avoid compounding potential errors, the user should use the original download version of the spreadsheet (without edits) at the beginning of each design."]
[]
[]
["User Input Note 6 - Input values should be in English units, with one exception: D50 for the bed substrate gradation (mm)."]
[]
[]
["ANALYSIS OF MULTIPLE LOG STRUCTURES"]
[]
["The LW Stability Analysis Tool can also be used to design multiple log structures.  The user must manually translate the resulting vertical and horizontal forces from one log design sheet into another (or write their own formulas).  This data should be entered in the \"Interaction Forces with Adjacent Logs\" section of the \"Single Log Design\" worksheet.  In theory, there is no limit to the number of logs that can be considered, although the force balance accounting may become cumbersome beyond a few logs.  The general procedure is as follows:"]
[]
[]
[]
[]
["Step 1","Begin by creating a preliminary structure layout (in AutoCAD or similar) to define the quantity of logs, locate intersect points, and identify key members.  Key members are typically the largest logs (or the logs that are going to be have anchors attached)."]
[]
[]
["Step 2","Fill out Sheets 1 through 5 of this tool.  Next, input the channel geometry in a blank \"Single Log Design\" worksheet (Sheet 6), and then make copies for analysis of each log."]
[null,null,null,null,null,null,null,null,null,null,null,"(Example) Required Resisting Forces for \"Non-Key\" Members (to be supplied by \"Key\" Members)"]
["Step 3","Complete a force balance analysis for each \"non-key member\" log, ignoring the \"Interaction Forces with Adjacent Logs\" and \"Anchor Forces\" sections.  The user should manually record the resisting forces required to stabilize each \"non-key member\" in a table.  The required vertical force can be found in cell 'K61' of the \"Single Log Design\" worksheet, and the required horizontal force can be found in cell 'K72'.  If the log is already vertically or horizontally stable, record the excess force that may be applied to resist driving forces of the adjacent log(s).  This information can be found in cell 'K62' and 'K73'.  An example table is shown to the right of these directions →"]
[null,null,null,null,null,null,null,null,null,null,null,"Log ID","FV (lbf)","FV (per \"key log\")","FH (lbf)","FH (per \"key log\")"]
[null,null,null,null,null,null,null,null,null,null,null,"Top #1",7278,{"$f":"M86/2","v":3639},1872,{"$f":"O86/2","v":936}]
[null,null,null,null,null,null,null,null,null,null,null,"Top #2",7113,{"$f":"M87/2","v":3556.5},1087,543.5]
[null,null,null,null,null,null,null,null,null,null,null,"Top #3",5323,2661.5,-3547,-1773.5]
[null,null,null,null,null,null,null,null,null,null,null,"* In this example, the required resisting forces for the 3 \"non-key\" members are divided between 2 proposed \"key\" members.  Note that the log identified as \"Top #3\" is horizontally stable (hence, listed as a negative number), with an excess resisting force of 3,547 lbf.  This excess force may be applied to resist the driving horizontal forces of the \"key\" members, provided the logs are pinned together.  These values in the columns highlighted in light yellow should be entered exactly as shown in the \"Interaction Forces with Adjacent Logs\" section of the \"Single Log Design\" worksheet for each \"key\" member."]
[]
["Step 4","Complete a force balance analysis for the \"key members\".  In the \"Interaction Forces with Adjacent Logs\" section on the force balance sheet, enter the relative position of each adjacent log in contact with the key member, the connection type (gravity or pinned), the intersection point, and the required vertical and horizontal forces to achieve stability for each \"non-key member\".  If the load from the adjacent logs is spread over multiple key members, divide the required forces by the number of key members sharing the load (note--these loads do not need to be evenly distributed between key members).  If an adjacent log is either horizontally or vertically stable, then enter any excess force (see Step 3 above) value as a negative number in the \"key member\" design spreadsheet.  The tool will automatically determine which loads are transferable to the next layer of logs.  For instance, a non-pinned member situated above the key member will not transfer buoyancy force to the key member."]
[]
[]
[]
[]
[]
[]
[]
[]
[]
["Step 5","Add \"Anchor Forces\" as necessary to stabilize the key members."]
["Step 6","Return to the \"non-key member\" log worksheets and in the \"Interaction Forces with Adjacent Logs\" section, input the forces that were resisted by the stability analysis of the key members.  Add additional \"Anchor Forces\" as necessary to stabilize the forces that were not resisted by the design of the key members."]
[]
[]
[]
["Tip 1:  It is recommended that the user creates a spreadsheet to tally the transferred forces for each log."]
["Tip 2:  The design of multiple log structures should initially focus on achieving vertical stability, before moving on to horizontal stability, and finally the moment analysis."]
[]
["Note 1:  Most design procedures for larger wood jams (ELJ's) typically ignore the lift and moment forces, and the drag coefficient may be assumed to be between 0.6 and 0.7 for the entire structure (plus corrections for constriction, or blockage, of the channel).  Therefore, the analysis procedure described above is likely conservative for larger structures."]
[]
[]
[]
["Note 2:  The designer should also perform scour computations and consider the structure's potential to trap mobile wood.  The design and/or factor of safety may need modified accordingly."]
[]
[]
["TO PRINT WORKBOOK"]
["Highlight tabs numbered 1 through 7, and click \"Print\".  Pages are pre-formatted except the \"Anchors\" Lookup sheet, which is not intended to be printed."]
[]
[]
["User is encouraged to provide comments and feedback for:"]
["Suitability:  Range of application or limitations"]
["Ease of use"]
["Results:  Are they reasonable and verified?"]
["Any other comments for improvement"]
["E-mail comments to:  ",null,null,null,"michael.rafferty@otak.com"]

{"sheet":"1-Cover","index":1,"n_rows":46,"n_cols":11,"rows_kept":46,"cut":false,"hidden":false,"merged":[[21,2,21,6],[18,10,19,13],[0,0,0,9],[2,0,2,9],[16,0,16,9],[18,2,18,6],[19,2,19,6],[20,2,20,6],[22,2,22,6],[23,2,23,6],[24,2,24,6],[37,0,37,9],[38,0,38,9],[44,0,44,9],[45,0,45,9],[44,10,45,14],[27,3,27,5],[30,1,30,3],[30,5,30,8],[29,1,29,2],[29,5,29,6],[40,0,40,9],[39,0,39,9],[41,0,42,9]]}
["Project Name"]
[]
["Large Wood Structure Stability Analysis"]
[]
[]
[]
[null,null,null,null,null,null,null,null,null,null,"← (Optional - Change Photograph)"]
[]
[]
[]
[]
[]
[]
[]
[]
[]
["TABLE OF CONTENTS"]
[null,null,null,null,null,null,null,"Sheet"]
[null,null,"Factors of Safety and Design Constants",null,null,null,null,2,null,null,"← (Note - Sheet names and numbering must be manually updated)"]
[null,null,"Hydrologic and Hydraulic Inputs",null,null,null,null,3]
[null,null,"Stream Bed Substrate Properties",null,null,null,null,4]
[null,null,"Bank Soil Properties",null,null,null,null,5]
[null,null,"Wood Properties",null,null,null,null,6]
[null,null,"Single Log Stability Analysis",null,null,null,null,"7 - 8"]
[null,null,"Notation and List of Symbols",null,null,null,null,"9 - 10"]
[]
[]
[null,null,"Date of Last Revision:","2014-02-04"]
[]
[null,"Designer:",null,null,null,"Reviewed by:"]
[null,"Name",null,null,null,"Not Applicable"]
[null,null,null,null,null,null,null,null,null,null,"← (Optional - Insert P.E. Stamp)"]
[]
[]
[]
[]
[]
["Reference for Design Method of Large Wood Structures:"]
["NRCS NEH 654 Technical Supplement 14J (2007)"]
[]
["Reference for Companion Paper:"]
["Rafferty, M. (2013). Development of a Computational Design Tool for Evaluating the Stability of Large Wood Structures Proposed for Stream Enhancement. Masters of Science Thesis, Colorado State University."]
[]
[]
["Large Wood Structure Stability Analysis Spreadsheet was developed by Michael Rafferty, P.E.",null,null,null,null,null,null,null,null,null,"← (Note - This design tool may be used by practitioners if they cite the developer on each sheet)"]
["Version 1.0"]

{"sheet":"2-Constants","index":2,"n_rows":19,"n_cols":4,"rows_kept":19,"cut":false,"hidden":false,"merged":[[0,2,1,3]]}
[{"$f":"'1-Cover'!A1","v":"Project Name"},null,"Spreadsheet developed by Michael Rafferty, P.E."]
["Factors of Safety and Design Constants"]
[]
["Symbol","Description","Value"]
["FSV","Factor of Safety for Vertical Force Balance",1.5]
["FSH","Factor of Safety for Horizontal Force Balance",2]
["FSM","Factor of Safety for Moment Force Balance",2]
[]
["Symbol","Description","Units","Value"]
["CLrock","Coefficient of lift for submerged boulder (D’Aoust, 2000)","-",0.17]
["CDrock","Coefficient of drag for submerged boulder (Schultz, 1954)","-",0.85]
["g","Gravitational acceleration constant","ft/s2",32.173999999999999]
["DFRW","Diameter factor for rootwad (DFRW = DRW/DTS)","-",3]
["LFRW","Length factor for rootwad (LFRW = LRW/DTS)","-",1.5]
["SGrock","Specific gravity of quartz particles","-",2.65]
["grock","Dry unit weight of boulders","lb/ft3",165]
["gw","Specific weight of water at 50⁰F","lb/ft3",62.4]
["h","Rootwad porosity from NRCS Tech Note 15 (2001)","-",0.2]
["n","Kinematic viscosity of water at 50⁰F","ft/s2",1.4100000000000001E-5]

{"sheet":"3-H&H","index":3,"n_rows":32,"n_cols":12,"rows_kept":32,"cut":false,"hidden":false,"merged":[[0,5,1,7],[31,9,33,17],[5,7,7,7],[5,9,7,9],[5,0,7,0],[5,4,7,4],[5,2,7,2],[5,5,7,5],[5,8,7,8],[5,3,7,3],[5,6,7,6],[5,1,7,1],[3,0,3,4]]}
[{"$f":"'1-Cover'!A1","v":"Project Name"},null,null,null,null,"Spreadsheet developed by                                Michael Rafferty, P.E."]
["Hydrologic and Hydraulic Inputs"]
[]
["Average Return Interval (ARI) of Design Discharge:",null,null,null,null,null,"yr"]
[]
["Site ID","Proposed Station","Design Discharge, Qdes (cfs)","Maximum Depth, dw (ft)","Average Velocity, uavg (ft/s)","Bankfull Width, WBF (ft)","Wetted Area, AW (ft2)","Radius of Curvature, Rc (ft)","Rc/WBF","Velocity at Outer Meander Bend1, um (ft/s)"]
[]
[]
[null,null,null,null,null,null,null,null,{"$f":"IF(OR($F9=\"\",$H9=\"\"),\"\",$H9/$F9)","v":""},{"$f":"IF(OR(E9=\"\",I9=\"\"),\"\",IF(I9>26,E9,E9*(1.74-(0.52*LOG(I9)))))","v":""}]
[null,null,null,null,null,null,null,null,"",""]
[null,null,null,null,null,null,null,null,"",""]
[null,null,null,null,null,null,null,null,"",""]
[null,null,null,null,null,null,null,null,"",""]
[null,null,null,null,null,null,null,null,"",""]
[null,null,null,null,null,null,null,null,"",""]
[null,null,null,null,null,null,null,null,"",""]
[null,null,null,null,null,null,null,null,"",""]
[null,null,null,null,null,null,null,null,"",""]
[null,null,null,null,null,null,null,null,"",""]
[null,null,null,null,null,null,null,null,"",""]
[null,null,null,null,null,null,null,null,"",""]
[null,null,null,null,null,null,null,null,"",""]
[null,null,null,null,null,null,null,null,"",""]
[null,null,null,null,null,null,null,null,"",""]
[null,null,null,null,null,null,null,null,"",""]
[null,null,null,null,null,null,null,null,"",""]
[null,null,null,null,null,null,null,null,"",""]
[null,null,null,null,null,null,null,null,"",""]
[null,null,null,null,null,null,null,null,null,"1 Meander velocity, um = ",null,"uavg          [for Rc/WBF > 26]"]
[null,null,null,null,null,null,null,null,null,null,null,"uavg(1.74 - 0.52 log (Rc/WBF))      [for Rc/WBF < 26]"]
[null,null,null,null,null,null,null,null,null,"Source for meander velocity in channel bends:"]
[null,null,null,null,null,null,null,null,null,"US Dept of Transportation. (2009) Hydraulic Engineering Circular No. 23 v2: Bridge Scour and Stream Instability Countermeasures: Experience, Selection, and Design Guidance-Third Edition. Design Guideline 4 Riprap Revetment."]

{"sheet":"4-Soil","index":4,"n_rows":30,"n_cols":30,"rows_kept":30,"cut":false,"hidden":false,"merged":[[2,15,2,19],[3,29,5,29],[3,0,5,0],[3,2,5,2],[3,4,5,4],[3,1,5,1],[3,15,5,15],[3,16,5,16],[3,17,5,17],[3,18,5,18],[3,7,5,7],[3,9,5,9],[3,8,5,8],[3,10,5,10],[3,12,5,12],[3,11,5,11],[26,3,27,7],[0,11,1,12],[0,6,1,7],[3,28,5,28],[3,19,5,19],[3,25,5,25],[3,21,5,21],[3,22,5,22],[3,23,5,23],[3,24,5,24],[3,3,5,3],[3,5,5,5],[3,26,5,26],[3,27,5,27],[2,21,2,29],[3,6,5,6]]}
[null,null,{"$f":"'1-Cover'!A1","v":"Project Name"},null,null,null,"Spreadsheet developed by Michael Rafferty, P.E.",null,{"$f":"'1-Cover'!A1","v":"Project Name"},null,null,"Spreadsheet developed by Michael Rafferty, P.E."]
[null,null,"Stream Bed Substrate Properties",null,null,null,null,null,"Bank Soil Properties",null,null,null,null,null,null,"Substrate and Soil Properties Lookup Table",null,null,null,null,null,"Bank Soil Properties Lookup Table"]
[null,null,null,null,null,null,null,null,null,null,null,null,null,null,null,"General Substrate and Soil Properties1",null,null,null,null,null,"Bank Soil Properties1"]
["Site ID","Proposed Station","Stream bed D50          (mm)","Stream Bed Substrate Grain Size Class","Bed Soil Class","Dry Unit Weight1,   gbed (lb/ft3)","Buoyant Unit Weight,   g'bed (lb/ft3)","Friction Angle, fbed (deg)","Bank Soils (from field observations)","Bank Soil Class","Dry Unit Weight,   gbank (lb/ft3)","Buoyant Unit Weight, g'bank (lb/ft3)","Friction Angle, fbank (deg)",null,null,"Grain size (mm)","Stream Substrate Sediment Class","Average Dry Unit Weight,    gs (lb/ft3)","Internal Friction Angle, f (deg)","Bed Soil Class",null,"Description (from field observations)","Bank Soil Class","Probe Value (in/lb)","Average Dry Unit Weight,    gbank (lb/ft3)","Friction Angle, fbank (deg)","Void ratio2, e (Vv/Vs)","Porosity, po e/(1+e)","Saturated Unit Weight3, gbank,sat (lb/ft3)","Buoyant Unit Weight4, g'bank (lb/ft3)"]
[]
[]
[{"$f":"IF('3-H&H'!A9=\"\",\"\",'3-H&H'!A9)","v":""},{"$f":"IF('3-H&H'!B9=\"\",\"\",'3-H&H'!B9)","v":""},null,{"$f":"IF(C7=\"\",\"\",IF(C7>2048,$Q$7,IF(C7>256,$Q$8,IF(C7>128,$Q$9,IF(C7>64,$Q$10,IF(C7>32,$Q$11,IF(C7>16,$Q$12,IF(C7>8,$Q$13,IF(C7>4,$Q$14,IF(C7>2,$Q$15,IF(C7>1,$Q$16,IF(C7>0.5,$Q$17,IF(C7>0.25,$Q$18,IF(C7>0.125,$Q$19,IF(C7>0.0625,$Q$20,IF(C7>0.004,$Q$21,$Q$22))))))))))))))))","v":""},{"$f":"IF(C7=\"\",\"\",VLOOKUP(D7,$Q$7:$T$22,4,0))","v":""},{"$f":"IF(C7=\"\",\"\",(1600+300*LOG(C7))*$E$30)","v":""},{"$f":"IF(D7=\"\",\"\",(((SG+((SG*SWWater/F7)-1))*SWWater)/(1+((SG*SWWater/F7)-1)))-SWWater)","v":""},{"$f":"IF(C7=\"\",\"\",VLOOKUP(D7,$Q$7:$T$22,3,0))","v":""},null,{"$f":"IF(I7=\"\",\"\",VLOOKUP(I7,$V$7:$Z$22,2,0))","v":""},{"$f":"IF(I7=\"\",\"\",VLOOKUP(I7,$V$7:$Z$22,4,0))","v":""},{"$f":"IF(I7=\"\",\"\",VLOOKUP(I7,$V$7:$AD$22,9,0))","v":""},{"$f":"IF(I7=\"\",\"\",VLOOKUP(I7,$V$7:$Z$22,5,0))","v":""},null,null,"Bedrock","Bedrock",165,"-",1,null,"Gravel/cobble",4,"400-500",{"$f":"R10","v":137},{"$f":"S10","v":41},{"$f":"((SG*SWWater)/Y7)-1","v":0.20700729927007289},{"$f":"AA7/(1+AA7)","v":0.17150459603289786},{"$f":"((SG+AA7)*SWWater)/(1+AA7)","v":147.70188679245283},{"$f":"AC7-SWWater","v":85.301886792452819}]
[{"$f":"IF('3-H&H'!A10=\"\",\"\",'3-H&H'!A10)","v":""},{"$f":"IF('3-H&H'!B10=\"\",\"\",'3-H&H'!B10)","v":""},null,"","","",{"$f":"IF(D8=\"\",\"\",(((SG+((SG*SWWater/F8)-1))*SWWater)/(1+((SG*SWWater/F8)-1)))-SWWater)","v":""},"",null,"","","","",null,null,"256-2048","Boulder",146,42,4,null,"Gravel, dense",4,"400-500",131.4,40,{"$f":"((SG*SWWater)/Y8)-1","v":0.25844748858447475},{"$f":"AA8/(1+AA8)","v":0.20537010159651661},{"$f":"((SG+AA8)*SWWater)/(1+AA8)","v":144.21509433962265},{"$f":"AC8-SWWater","v":81.815094339622647}]
[{"$f":"IF('3-H&H'!A11=\"\",\"\",'3-H&H'!A11)","v":""},{"$f":"IF('3-H&H'!B11=\"\",\"\",'3-H&H'!B11)","v":""},null,"","","","","",null,"","","","",null,null,"128-256","Large Cobble",142.6,42,4,null,"Gravel, loose",5,"300-400",125.7,36,0.31551312649164664,0.2398403483309143,140.66603773584907,78.266037735849068]
[{"$f":"IF('3-H&H'!A12=\"\",\"\",'3-H&H'!A12)","v":""},{"$f":"IF('3-H&H'!B12=\"\",\"\",'3-H&H'!B12)","v":""},null,"","","","","",null,"","","","",null,null,"64-128","Small Cobble",137,41,4,null,"Gravel/sand",5,"400-500",111.65,39,0.48105687416032228,0.32480648282535068,131.91792452830188,69.517924528301876]
[{"$f":"IF('3-H&H'!A13=\"\",\"\",'3-H&H'!A13)","v":""},{"$f":"IF('3-H&H'!B13=\"\",\"\",'3-H&H'!B13)","v":""},null,"","","","","",null,"","","","",null,null,"32-64","Very coarse gravel",131.4,40,5,null,"Coarse sand, dense",5,"300-400",120,43,0.37799999999999989,0.27431059506531197,137.11698113207547,74.71698113207546]
[{"$f":"IF('3-H&H'!A14=\"\",\"\",'3-H&H'!A14)","v":""},{"$f":"IF('3-H&H'!B14=\"\",\"\",'3-H&H'!B14)","v":""},null,"","","","","",null,"","","","",null,null,"16-32","Coarse gravel",125.7,38,5,null,"Coarse sand, loose",6,"200-300",98,31,0.68734693877551001,0.40735365263667145,123.41886792452831,61.018867924528315]
[{"$f":"IF('3-H&H'!A15=\"\",\"\",'3-H&H'!A15)","v":""},{"$f":"IF('3-H&H'!B15=\"\",\"\",'3-H&H'!B15)","v":""},null,"","","","","",null,"","","","",null,null,"8-16","Medium gravel",120.1,36,5,null,"Fine sand, dense",6,"200-300",114,42,0.45052631578947366,0.31059506531204645,133.3811320754717,70.981132075471692]
[{"$f":"IF('3-H&H'!A16=\"\",\"\",'3-H&H'!A16)","v":""},{"$f":"IF('3-H&H'!B16=\"\",\"\",'3-H&H'!B16)","v":""},null,"","","","","",null,"","","","",null,null,"4-8","Fine gravel",114.5,35,5,null,"Fine sand, loose",7,"100-200",93,30,0.77806451612903205,0.43759071117561676,120.30566037735849,57.905660377358494]
[{"$f":"IF('3-H&H'!A17=\"\",\"\",'3-H&H'!A17)","v":""},{"$f":"IF('3-H&H'!B17=\"\",\"\",'3-H&H'!B17)","v":""},null,"","","","","",null,"","","","",null,null,"2-4","Very fine gravel",108.8,33,6,null,"Clay, firm",6,"200-300",90,27,0.83733333333333326,0.45573294629898403,118.43773584905659,56.037735849056595]
[{"$f":"IF('3-H&H'!A18=\"\",\"\",'3-H&H'!A18)","v":""},{"$f":"IF('3-H&H'!B18=\"\",\"\",'3-H&H'!B18)","v":""},null,"","","","","",null,"","","","",null,null,"1-2","Very course sand",103.2,32,6,null,"Clay, soft",7,"100-200",78,25,1.1199999999999997,0.52830188679245271,110.96603773584906,48.566037735849058]
[{"$f":"IF('3-H&H'!A19=\"\",\"\",'3-H&H'!A19)","v":""},{"$f":"IF('3-H&H'!B19=\"\",\"\",'3-H&H'!B19)","v":""},null,"","","","","",null,"","","","",null,null,"0.5-1","Coarse sand",98,31,6,null,"Clayey silt",6,"200-300",84,27,0.96857142857142842,0.4920174165457184,114.70188679245283,52.301886792452827]
[{"$f":"IF('3-H&H'!A20=\"\",\"\",'3-H&H'!A20)","v":""},{"$f":"IF('3-H&H'!B20=\"\",\"\",'3-H&H'!B20)","v":""},null,"","","","","",null,"","","","",null,null,"0.25-0.5","Medium sand",94,30,7,null,"Silt, firm",6,"200-300",90,32,0.83733333333333326,0.45573294629898403,118.43773584905659,56.037735849056595]
[{"$f":"IF('3-H&H'!A21=\"\",\"\",'3-H&H'!A21)","v":""},{"$f":"IF('3-H&H'!B21=\"\",\"\",'3-H&H'!B21)","v":""},null,"","","","","",null,"","","","",null,null,"0.125-0.25","Fine sand",93,30,7,null,"Silt, soft",7,"100-200",82,30,1.0165853658536586,0.50411223996129662,113.4566037735849,51.056603773584904]
[{"$f":"IF('3-H&H'!A22=\"\",\"\",'3-H&H'!A22)","v":""},{"$f":"IF('3-H&H'!B22=\"\",\"\",'3-H&H'!B22)","v":""},null,"","","","","",null,"","","","",null,null,"0.063-0.125","Very fine sand",92,30,7,null,"Bedrock, solid",1,"-",165,"-","-","-","-","-"]
[{"$f":"IF('3-H&H'!A23=\"\",\"\",'3-H&H'!A23)","v":""},{"$f":"IF('3-H&H'!B23=\"\",\"\",'3-H&H'!B23)","v":""},null,"","","","","",null,"","","","",null,null,"0.004-0.063","Silt",82,30,7,null,"Custom1 (optional)","(input)","(input)","(input)","(input)",{"$f":"IF(Y21=\"(input)\",\"\",((SG*SWWater)/Y21)-1)","v":""},{"$f":"IF(Y21=\"(input)\",\"\",AA21/(1+AA21))","v":""},{"$f":"IF(Y21=\"(input)\",\"\",((SG+AA21)*SWWater)/(1+AA21))","v":""},{"$f":"IF(Y21=\"(input)\",\"\",AC21-SWWater)","v":""}]
[{"$f":"IF('3-H&H'!A24=\"\",\"\",'3-H&H'!A24)","v":""},{"$f":"IF('3-H&H'!B24=\"\",\"\",'3-H&H'!B24)","v":""},null,"","","","","",null,"","","","",null,null,"< 0.004","Clay",78,25,7,null,"Custom2 (optional)","(input)","(input)","(input)","(input)",{"$f":"IF(Y22=\"(input)\",\"\",((SG*SWWater)/Y22)-1)","v":""},{"$f":"IF(Y22=\"(input)\",\"\",AA22/(1+AA22))","v":""},{"$f":"IF(Y22=\"(input)\",\"\",((SG+AA22)*SWWater)/(1+AA22))","v":""},{"$f":"IF(Y22=\"(input)\",\"\",AC22-SWWater)","v":""}]
[{"$f":"IF('3-H&H'!A25=\"\",\"\",'3-H&H'!A25)","v":""},{"$f":"IF('3-H&H'!B25=\"\",\"\",'3-H&H'!B25)","v":""},null,"","","","","",null,"","","","",null,null,"1 Compiled from Julien (2010) and Shen and Julien (1993)",null,null,null,null,null,"1 Compiled from NRCS Table TS14E–2 Soil classification and Bowles (2001)"]
[{"$f":"IF('3-H&H'!A26=\"\",\"\",'3-H&H'!A26)","v":""},{"$f":"IF('3-H&H'!B26=\"\",\"\",'3-H&H'!B26)","v":""},null,"","","","","",null,"","","","",null,null,null,null,null,null,null,null,"2 Void ratio, e, is backcalculated using the following equation:  e = (SGrock*gw/gbank) - 1"]
[{"$f":"IF('3-H&H'!A27=\"\",\"\",'3-H&H'!A27)","v":""},{"$f":"IF('3-H&H'!B27=\"\",\"\",'3-H&H'!B27)","v":""},null,"","","","","",null,"","","","",null,null,null,null,null,null,null,null,"3 Saturated Unit Weight of soil, gbank,sat = ((SGrock+e)*gw)/(1+e)"]
[{"$f":"IF('3-H&H'!A28=\"\",\"\",'3-H&H'!A28)","v":""},{"$f":"IF('3-H&H'!B28=\"\",\"\",'3-H&H'!B28)","v":""},null,"","","","","",null,"","","","",null,null,null,null,null,null,null,null,"4 Effective Buoyant Unit Weight of soil, g'bank = gbank,sat - gw"]
[null,null,"Source:","Compiled from Julien (2010) and Shen and Julien (1993); soil classes from NRCS Table TS14E–2 Soil classification"]
[]
[null,null,"1 gbed (kg/m3) = 1,600 + 300 log D50 (mm)   ",null,null,null," (from Julien 2010)"]
[null,null,null,"1 kg/m3 =",6.2427999999999997E-2,"1 lb/ft3"]

{"sheet":"5-Wood","index":5,"n_rows":130,"n_cols":33,"rows_kept":130,"cut":false,"hidden":false,"merged":[[0,20,0,25],[0,27,0,32],[64,27,64,32],[0,13,0,18],[68,20,68,25],[0,3,1,4],[61,6,61,11],[58,13,58,18],[5,0,5,2],[27,0,28,4],[17,0,19,4],[20,0,24,4],[25,6,25,11],[5,3,6,3],[5,4,6,4]]}
[{"$f":"'1-Cover'!A1","v":"Project Name"},null,null,"Spreadsheet developed by Michael Rafferty, P.E.",null,null,null,null,null,null,null,null,null,"Common Trees in Great Plains Region",null,null,null,null,null,null,"Common Trees in Upper Midwest Region",null,null,null,null,null,null,"Common Trees in New England Region"]
["Large Wood Properties",null,null,null,null,null,null,null,null,null,null,null,null,"Common Name","Scientific Name","Type","SGT","gTd (lb/ft3)","gTgr (lb/ft3)",null,"Common Name","Scientific Name","Type","SGT","gTd (lb/ft3)","gTgr (lb/ft3)",null,"Common Name","Scientific Name","Type","SGT","gTd (lb/ft3)","gTgr (lb/ft3)"]
[null,null,null,null,null,null,null,null,null,null,null,null,null,"Ash, Black","Fraxinus nigra","Hardwood",0.49,{"$f":"Q3*62.4*1.12","v":34.245120000000007},52,null,"Ash, Black","Fraxinus nigra","Hardwood",0.49,{"$f":"X3*62.4*1.12","v":34.245120000000007},52,null,"Ash, Black","Fraxinus nigra","Hardwood",0.49,{"$f":"AE3*62.4*1.12","v":34.245120000000007},52]
["Project Location:",null,null,null,null,null,null,null,null,null,null,null,null,"Ash, Blue","Fraxinus quadrangulata","Hardwood",0.57999999999999996,40.535040000000002,50,null,"Ash, Blue","Fraxinus quadrangulata","Hardwood",0.57999999999999996,40.535040000000002,50,null,"Ash, Green","Fraxinus pennsylvanica","Hardwood",0.56000000000000005,39.137280000000004,52]
[null,null,null,null,null,null,null,null,null,null,null,null,null,"Ash, Green","Fraxinus pennsylvanica","Hardwood",0.56000000000000005,39.137280000000004,52,null,"Ash, Green","Fraxinus pennsylvanica","Hardwood",0.56000000000000005,39.137280000000004,52,null,"Ash, White","Fraxinus americana","Hardwood",0.6,41.9328,50]
["Timber Unit Weights",null,null,"Air-dried1 gTd (lb/ft3)","Green2 gTgr (lb/ft3)",null,null,null,null,null,null,null,null,"Ash, White","Fraxinus americana","Hardwood",0.6,41.9328,50,null,"Ash, White","Fraxinus americana","Hardwood",0.6,41.9328,50,null,"Aspen, Bigtooth","Populus grandidentata","Hardwood",0.39,27.256320000000002,43]
["Selected Species","Common Name","Scientific Name",null,null,null,null,null,null,null,null,null,null,"Aspen, Bigtooth","Populus grandidentata","Hardwood",0.39,27.256320000000002,43,null,"Aspen, Bigtooth","Populus grandidentata","Hardwood",0.39,27.256320000000002,43,null,"Aspen, Quaking","Populus tremuloides","Hardwood",0.38,26.557440000000003,50]
["Tree Type #1:",null,{"$f":"IF($B8=\"\",\"\",IF($B$4=\"West Coast\",VLOOKUP($B8,WCTreesTable,2,0),IF($B$4=\"Mountain West\",VLOOKUP($B8,MWTreesTable,2,0),IF($B$4=\"Great Plains\",VLOOKUP($B8,GPTreesTable,2,0),IF($B$4=\"South Central\",VLOOKUP($B8,SCTreesTable,2,0),IF($B$4=\"Upper Midwest\",VLOOKUP($B8,UMWTreesTable,2,0),IF($B$4=\"Southeast\",VLOOKUP($B8,SETreesTable,2,0),IF($B$4=\"New England\",VLOOKUP($B8,NETreesTable,2,0),IF($B$4=\"Mid-Atlantic\",VLOOKUP($B8,MATreesTable,2,0),\"\")))))))))","v":""},{"$f":"IF($B8=\"\",\"\",IF($B$4=\"West Coast\",VLOOKUP($B8,WCTreesTable,5,0),IF($B$4=\"Mountain West\",VLOOKUP($B8,MWTreesTable,5,0),IF($B$4=\"Great Plains\",VLOOKUP($B8,GPTreesTable,5,0),IF($B$4=\"South Central\",VLOOKUP($B8,SCTreesTable,5,0),IF($B$4=\"Upper Midwest\",VLOOKUP($B8,UMWTreesTable,5,0),IF($B$4=\"Southeast\",VLOOKUP($B8,SETreesTable,5,0),IF($B$4=\"New England\",VLOOKUP($B8,NETreesTable,5,0),IF($B$4=\"Mid-Atlantic\",VLOOKUP($B8,MATreesTable,5,0),\"\")))))))))","v":""},{"$f":"IF($B8=\"\",\"\",IF($B$4=\"West Coast\",VLOOKUP($B8,WCTreesTable,6,0),IF($B$4=\"Mountain West\",VLOOKUP($B8,MWTreesTable,6,0),IF($B$4=\"Great Plains\",VLOOKUP($B8,GPTreesTable,6,0),IF($B$4=\"South Central\",VLOOKUP($B8,SCTreesTable,6,0),IF($B$4=\"Upper Midwest\",VLOOKUP($B8,UMWTreesTable,6,0),IF($B$4=\"Southeast\",VLOOKUP($B8,SETreesTable,6,0),IF($B$4=\"New England\",VLOOKUP($B8,NETreesTable,6,0),IF($B$4=\"Mid-Atlantic\",VLOOKUP($B8,MATreesTable,6,0),\"\")))))))))","v":""},null,null,null,null,null,null,null,null,"Aspen, Quaking","Populus tremuloides","Hardwood",0.38,26.557440000000003,50,null,"Aspen, Quaking","Populus tremuloides","Hardwood",0.38,26.557440000000003,50,null,"Balsam poplar (cottonwood)","Populus balsamifera","Hardwood",0.34,23.761920000000003,40]
["Tree Type #2:",null,"","","",null,null,null,null,null,null,null,null,"Balsam poplar (cottonwood)","Populus balsamifera","Hardwood",0.34,23.761920000000003,40,null,"Balsam poplar (cottonwood)","Populus balsamifera","Hardwood",0.34,23.761920000000003,40,null,"Basswood, American","Tilia americana","Hardwood",0.37,25.858560000000004,41]
["Tree Type #3:",null,"","","",null,null,null,null,null,null,null,null,"Basswood, American","Tilia americana","Hardwood",0.37,25.858560000000004,41,null,"Basswood, American","Tilia americana","Hardwood",0.37,25.858560000000004,41,null,"Beech, American","Fagus grandifolia","Hardwood",0.64,44.728320000000004,54]
["Tree Type #4:",null,"","","",null,null,null,null,null,null,null,null,"Birch, Paper","Betula papyrifera","Hardwood",0.55000000000000004,38.438400000000001,52,null,"Beech, American","Fagus grandifolia","Hardwood",0.64,44.728320000000004,54,null,"Birch, Paper","Betula papyrifera","Hardwood",0.55000000000000004,38.438400000000001,52]
["Tree Type #5:",null,"","","",null,null,null,null,null,null,null,null,"Birch, Yellow","Betula alleghaniensis","Hardwood",0.62,43.330560000000006,59,null,"Birch, Paper","Betula papyrifera","Hardwood",0.55000000000000004,38.438400000000001,52,null,"Birch, Sweet","Betula lenta","Hardwood",0.65,45.427200000000006,65]
["Tree Type #6:",null,"","","",null,null,null,null,null,null,null,null,"Butternut","Juglans cinerea","Hardwood",0.38,26.557440000000003,46,null,"Birch, Sweet","Betula lenta","Hardwood",0.65,45.427200000000006,65,null,"Birch, Yellow","Betula alleghaniensis","Hardwood",0.62,43.330560000000006,59]
["Tree Type #7:",null,"","","",null,null,null,null,null,null,null,null,"Cedar, Eastern redcedar","Juniperus virginiana","Softwood",0.47,32.847360000000002,37,null,"Birch, Yellow","Betula alleghaniensis","Hardwood",0.62,43.330560000000006,59,null,"Butternut","Juglans cinerea","Hardwood",0.38,26.557440000000003,46]
["Tree Type #8:",null,"","","",null,null,null,null,null,null,null,null,"Cedar, Northern white","Thuja occidentalis","Softwood",0.31,21.665280000000003,36,null,"Butternut","Juglans cinerea","Hardwood",0.38,26.557440000000003,46,null,"Cedar, Atlantic white","Chamaecyparis thyoides","Softwood",0.32,22.364160000000002,36]
["Tree Type #9:",null,"","","",null,null,null,null,null,null,null,null,"Cherry, Black","Prunus serotina","Hardwood",0.5,34.944000000000003,45,null,"Cedar, Eastern redcedar","Juniperus virginiana","Softwood",0.47,32.847360000000002,37,null,"Cedar, Eastern redcedar","Juniperus virginiana","Softwood",0.47,32.847360000000002,37]
["Tree Type #10:",null,"","","",null,null,null,null,null,null,null,null,"Cottonwood, Eastern","Populus deltoides","Hardwood",0.4,27.955200000000005,50,null,"Cedar, Northern white","Thuja occidentalis","Softwood",0.31,21.665280000000003,36,null,"Cedar, Northern white","Thuja occidentalis","Softwood",0.31,21.665280000000003,36]
["1 Air-dried unit weight, gTd = Average unit weight of wood after exposure to air on a 12% moisture content volume basis.  Air-dried unit weight is used in the force balance calculations for the portion of wood that is above the proposed thalweg elevation (assuming unsaturated conditions).",null,null,null,null,null,null,null,null,null,null,null,null,"Elm, American","Ulmus americana","Hardwood",0.5,34.944000000000003,56,null,"Cherry, Black","Prunus serotina","Hardwood",0.5,34.944000000000003,45,null,"Cherry, Black","Prunus serotina","Hardwood",0.5,34.944000000000003,45]
[null,null,null,null,null,null,null,null,null,null,null,null,null,"Elm, Rock","Ulmus thomasii","Hardwood",0.63,44.029440000000001,54,null,"Chestnut, American","Castanea dentata","Hardwood",0.43,30.051840000000002,55,null,"Chestnut, American","Castanea dentata","Hardwood",0.43,30.051840000000002,55]
[null,null,null,null,null,null,null,null,null,null,null,null,null,"Elm, Slippery","Ulmus rubra","Hardwood",0.53,37.040640000000003,53,null,"Cottonwood, Eastern","Populus deltoides","Hardwood",0.4,27.955200000000005,50,null,"Cottonwood, Eastern","Populus deltoides","Hardwood",0.4,27.955200000000005,50]
["2 Green unit weight, gTgr = Average unit weight of freshly sawn wood when the cell walls are completely saturated with water. Green unit weight is used in the force balance calculations as a conservative estimate of the unit weight for the portion of wood that is below the proposed thalweg elevation (assuming saturated conditions). For comparison, Thevenet, Citterio, & Piegay (1998) determined wood unit weight typically increases by more than 100% after less than 24 hours exposure to water.",null,null,null,null,null,null,null,null,null,null,null,null,"Fir, Balsam","Abies balsamea","Softwood",0.35,24.460800000000003,45,null,"Cucumbertree (magnolia)","Magnolia acuminata","Hardwood",0.48,33.546240000000004,48,null,"Cucumbertree (magnolia)","Magnolia acuminata","Hardwood",0.48,33.546240000000004,48]
[null,null,null,null,null,null,null,null,null,null,null,null,null,"Hackberry","Celtis occidentalis","Hardwood",0.53,37.040640000000003,50,null,"Elm, American","Ulmus americana","Hardwood",0.5,34.944000000000003,56,null,"Elm, American","Ulmus americana","Hardwood",0.5,34.944000000000003,56]
[null,null,null,null,null,null,null,null,null,null,null,null,null,"Hickory, Bitternut","Carya cordiformis","Hardwood",0.66,46.126080000000002,64,null,"Elm, Rock","Ulmus thomasii","Hardwood",0.63,44.029440000000001,54,null,"Elm, Rock","Ulmus thomasii","Hardwood",0.63,44.029440000000001,54]
[null,null,null,null,null,null,null,null,null,null,null,null,null,"Hickory, Mockernut","Carya tomentosa","Hardwood",0.72,50.319360000000003,65,null,"Elm, Slippery","Ulmus rubra","Hardwood",0.53,37.040640000000003,53,null,"Elm, Slippery","Ulmus rubra","Hardwood",0.53,37.040640000000003,53]
[null,null,null,null,null,null,null,null,null,null,null,null,null,"Hickory, Pignut","Carya glabra","Hardwood",0.75,52.416000000000004,68,null,"Fir, Balsam","Abies balsamea","Softwood",0.35,24.460800000000003,45,null,"Fir, Balsam","Abies balsamea","Softwood",0.35,24.460800000000003,45]
[null,null,null,null,null,null,"Common Trees in West Coast Region",null,null,null,null,null,null,"Hickory, Shagbark","Carya ovata","Hardwood",0.72,50.319360000000003,64,null,"Hackberry","Celtis occidentalis","Hardwood",0.53,37.040640000000003,50,null,"Hackberry","Celtis occidentalis","Hardwood",0.53,37.040640000000003,50]
["Source for timber unit weights:",null,null,null,null,null,"Common Name","Scientific Name","Type","SGT","gTd (lb/ft3)","gTgr (lb/ft3)",null,"Hickory, Shellbark","Carya laciniosa","Hardwood",0.69,48.222720000000002,64,null,"Hemlock, Eastern","Tsuga canadensis","Softwood",0.4,27.955200000000005,50,null,"Hemlock, Eastern","Tsuga canadensis","Softwood",0.4,27.955200000000005,50]
["U.S. Department of Agriculture, U.S. Forest Service. (2009) Specific Gravity and Other Properties of Wood and Bark for 156 Tree Species Found in North America. Research Note NRS-38. Table 1A.",null,null,null,null,null,"Alder, Red","Alnus rubra","Hardwood",0.41,{"$f":"J28*62.4*1.12","v":28.654080000000004},46,null,"Honey locust","Gleditsia triacanthos","Hardwood",0.65,45.427200000000006,60,null,"Hickory, Bitternut","Carya cordiformis","Hardwood",0.66,46.126080000000002,64,null,"Hickory, Bitternut","Carya cordiformis","Hardwood",0.66,46.126080000000002,64]
[null,null,null,null,null,null,"Ash, Oregon","Fraxinus latifolia","Hardwood",0.55000000000000004,38.438400000000001,50,null,"Locust, Black","Robinia pseudoacacia","Hardwood",0.69,48.222720000000002,58,null,"Hickory, Mockernut","Carya tomentosa","Hardwood",0.72,50.319360000000003,65,null,"Hickory, Mockernut","Carya tomentosa","Hardwood",0.72,50.319360000000003,65]
[null,null,null,null,null,null,"Aspen, Quaking","Populus tremuloides","Hardwood",0.38,26.557440000000003,50,null,"Maple, Black","Acer nigrum","Hardwood",0.56999999999999995,39.83616,55,null,"Hickory, Pignut","Carya glabra","Hardwood",0.75,52.416000000000004,68,null,"Hickory, Pignut","Carya glabra","Hardwood",0.75,52.416000000000004,68]
[null,null,null,null,null,null,"Birch, Paper","Betula papyrifera","Hardwood",0.55000000000000004,38.438400000000001,52,null,"Maple, Red","Acer rubrum","Hardwood",0.54,37.739519999999999,50,null,"Hickory, Shagbark","Carya ovata","Hardwood",0.72,50.319360000000003,64,null,"Hickory, Shagbark","Carya ovata","Hardwood",0.72,50.319360000000003,64]
[null,null,null,null,null,null,"Cedar, Alaska-yellow","Cupressus nootkatensis","Softwood",0.44,30.750720000000001,45,null,"Maple, Silver","Acer saccharinum","Hardwood",0.47,32.847360000000002,46,null,"Hickory, Shellbark","Carya laciniosa","Hardwood",0.69,48.222720000000002,64,null,"Hickory, Shellbark","Carya laciniosa","Hardwood",0.69,48.222720000000002,64]
[null,null,null,null,null,null,"Cedar, Incense","Calocedrus decurrens","Softwood",0.37,25.858560000000004,45,null,"Maple, Sugar","Acer saccharum","Hardwood",0.63,44.029440000000001,55,null,"Honey locust","Gleditsia triacanthos","Hardwood",0.65,45.427200000000006,60,null,"Honey locust","Gleditsia triacanthos","Hardwood",0.65,45.427200000000006,60]
[null,null,null,null,null,null,"Cedar, Port-Orford","Chamaecyparis lawsoniana","Softwood",0.43,30.051840000000002,42,null,"Oak, Black","Quercus velutina","Hardwood",0.61,42.631680000000003,64,null,"Locust, Black","Robinia pseudoacacia","Hardwood",0.69,48.222720000000002,58,null,"Locust, Black","Robinia pseudoacacia","Hardwood",0.69,48.222720000000002,58]
[null,null,null,null,null,null,"Cedar, Western redcedar","Thuja plicata","Softwood",0.32,22.364160000000002,27,null,"Oak, Bur","Quercus macrocarpa","Hardwood",0.64,{"$f":"Q35*62.4*1.12","v":44.728320000000004},63,null,"Maple, Black","Acer nigrum","Hardwood",0.56999999999999995,{"$f":"X35*62.4*1.12","v":39.83616},55,null,"Maple, Black","Acer nigrum","Hardwood",0.56999999999999995,{"$f":"AE35*62.4*1.12","v":39.83616},55]
[null,null,null,null,null,null,"Cottonwood, Black","Populus trichocarpa","Hardwood",0.35,24.460800000000003,46,null,"Oak, Cherrybark","Quercus pagoda","Hardwood",0.69,48.222720000000002,64,null,"Maple, Red","Acer rubrum","Hardwood",0.54,37.739519999999999,50,null,"Maple, Red","Acer rubrum","Hardwood",0.54,37.739519999999999,50]
[null,null,null,null,null,null,"Douglas-fir, Coast","Pseudotsuga menziesii var. menzi.","Softwood",0.48,33.546240000000004,38,null,"Oak, Northern red","Quercus rubra","Hardwood",0.63,44.029440000000001,64,null,"Maple, Silver","Acer saccharinum","Hardwood",0.47,32.847360000000002,46,null,"Maple, Silver","Acer saccharinum","Hardwood",0.47,32.847360000000002,46]
[null,null,null,null,null,null,"Douglas-fir, Interior west","Pseudotsuga menziesii var. glauca","Softwood",0.5,34.944000000000003,39,null,"Oak, Pin","Quercus palustris","Hardwood",0.63,44.029440000000001,64,null,"Maple, Sugar","Acer saccharum","Hardwood",0.63,44.029440000000001,55,null,"Maple, Sugar","Acer saccharum","Hardwood",0.63,44.029440000000001,55]
[null,null,null,null,null,null,"Fir, California red","Abies magnifica","Softwood",0.38,26.557440000000003,48,null,"Oak, Post ","Quercus stellata","Hardwood",0.67,46.824960000000004,64,null,"Oak, Black","Quercus velutina","Hardwood",0.61,42.631680000000003,64,null,"Oak, Black","Quercus velutina","Hardwood",0.61,42.631680000000003,64]
[null,null,null,null,null,null,"Fir, Grand","Abies grandis","Softwood",0.37,25.858560000000004,45,null,"Oak, Scarlet","Quercus coccinea","Hardwood",0.67,46.824960000000004,64,null,"Oak, Bur","Quercus macrocarpa","Hardwood",0.64,44.728320000000004,63,null,"Oak, Bur","Quercus macrocarpa","Hardwood",0.64,44.728320000000004,63]
[null,null,null,null,null,null,"Fir, Noble","Abies procera","Softwood",0.39,27.256320000000002,30,null,"Oak, Southern red","Quercus falcata","Hardwood",0.59,41.233919999999998,64,null,"Oak, Cherrybark","Quercus pagoda","Hardwood",0.69,48.222720000000002,64,null,"Oak, Chestnut","Quercus prinus","Hardwood",0.66,46.126080000000002,63]
[null,null,null,null,null,null,"Fir, Pacific silver","Abies amabilis","Softwood",0.43,30.051840000000002,42,null,"Oak, Swamp white","Quercus bicolor","Hardwood",0.72,50.319360000000003,63,null,"Oak, Chestnut","Quercus prinus","Hardwood",0.66,46.126080000000002,63,null,"Oak, Northern red","Quercus rubra","Hardwood",0.63,44.029440000000001,64]
[null,null,null,null,null,null,"Fir, Subalpine","Abies lasiocarpa","Softwood",0.32,22.364160000000002,28,null,"Oak, White","Quercus alba","Hardwood",0.68,47.523840000000007,63,null,"Oak, Northern red","Quercus rubra","Hardwood",0.63,44.029440000000001,64,null,"Oak, Pin","Quercus palustris","Hardwood",0.63,44.029440000000001,64]
[null,null,null,null,null,null,"Fir, White","Abies concolor","Softwood",0.39,27.256320000000002,47,null,"Pecan (hickory)","Carya illinoinensis","Hardwood",0.66,46.126080000000002,62,null,"Oak, Overcup","Quercus lyrata","Hardwood",0.63,44.029440000000001,63,null,"Oak, Post ","Quercus stellata","Hardwood",0.67,46.824960000000004,64]
[null,null,null,null,null,null,"Hemlock, Mountain","Tsuga mertensiana","Softwood",0.45,31.4496,44,null,"Pine, Eastern white","Pinus strobus","Softwood",0.35,24.460800000000003,35,null,"Oak, Pin","Quercus palustris","Hardwood",0.63,44.029440000000001,64,null,"Oak, Scarlet","Quercus coccinea","Hardwood",0.67,46.824960000000004,64]
[null,null,null,null,null,null,"Hemlock, Western","Tsuga heterophylla","Softwood",0.45,31.4496,41,null,"Pine, Jack","Pinus banksiana","Softwood",0.43,30.051840000000002,50,null,"Oak, Post ","Quercus stellata","Hardwood",0.67,46.824960000000004,64,null,"Oak, Swamp white","Quercus bicolor","Hardwood",0.72,50.319360000000003,63]
[null,null,null,null,null,null,"Larch, Western","Larix occidentalis","Softwood",0.52,36.341760000000001,48,null,"Pine, Red","Pinus resinosa","Softwood",0.46,32.148480000000006,42,null,"Oak, Scarlet","Quercus coccinea","Hardwood",0.67,46.824960000000004,64,null,"Oak, White","Quercus alba","Hardwood",0.68,47.523840000000007,63]
[null,null,null,null,null,null,"Maple, Bigleaf","Acer macrophyllum","Hardwood",0.48,33.546240000000004,47,null,"Pine, Shortleaf","Pinus echinata","Softwood",0.51,35.642879999999998,52,null,"Oak, Southern red","Quercus falcata","Hardwood",0.59,41.233919999999998,64,null,"Pine, Eastern white","Pinus strobus","Softwood",0.35,24.460800000000003,35]
[null,null,null,null,null,null,"Pine, Lodgepole","Pinus contorta","Softwood",0.41,28.654080000000004,39,null,"Spruce, Black","Picea mariana","Softwood",0.46,32.148480000000006,35,null,"Oak, Swamp chestnut","Quercus michauxii","Hardwood",0.67,46.824960000000004,63,null,"Pine, Jack","Pinus banksiana","Softwood",0.43,30.051840000000002,50]
[null,null,null,null,null,null,"Pine, Ponderosa","Pinus ponderosa","Softwood",0.4,27.955200000000005,45,null,"Spruce, White","Picea glauca","Softwood",0.4,27.955200000000005,35,null,"Oak, Swamp white","Quercus bicolor","Hardwood",0.72,50.319360000000003,63,null,"Pine, Pitch","Pinus rigida","Softwood",0.52,36.341760000000001,50]
[null,null,null,null,null,null,"Pine, Sugar","Pinus lambertiana","Softwood",0.36,25.159680000000002,49,null,"Sycamore, American","Platanus occidentalis","Hardwood",0.49,34.245120000000007,52,null,"Oak, White","Quercus alba","Hardwood",0.68,47.523840000000007,63,null,"Pine, Red","Pinus resinosa","Softwood",0.46,32.148480000000006,42]
[null,null,null,null,null,null,"Pine, Western white","Pinus monticola","Softwood",0.38,26.557440000000003,35,null,"Tamarack","Larix laricina","Softwood",0.53,37.040640000000003,47,null,"Pecan (hickory)","Carya illinoinensis","Hardwood",0.66,46.126080000000002,62,null,"Pine, Shortleaf","Pinus echinata","Softwood",0.51,35.642879999999998,52]
[null,null,null,null,null,null,"Redwood, Coast (Old)","Sequoia sempervirens","Softwood",0.4,27.955200000000005,50,null,"Tupelo, Black","Nyssa sylvatica","Hardwood",0.5,34.944000000000003,56,null,"Pine, Eastern white","Pinus strobus","Softwood",0.35,24.460800000000003,35,null,"Pine, Virginia","Pinus virginiana","Softwood",0.48,33.546240000000004,50]
[null,null,null,null,null,null,"Redwood, Coast (young)","Sequoia sempervirens","Softwood",0.35,24.460800000000003,50,null,"Walnut, Black","Juglans nigra","Hardwood",0.55000000000000004,38.438400000000001,57,null,"Pine, Jack","Pinus banksiana","Softwood",0.43,30.051840000000002,50,null,"Spruce, Black","Picea mariana","Softwood",0.46,32.148480000000006,35]
[null,null,null,null,null,null,"Spruce, Engelmann","Picea engelmannii","Softwood",0.35,24.460800000000003,39,null,"Willow, Black","Salix nigra","Hardwood",0.39,27.256320000000002,51,null,"Pine, Pitch","Pinus rigida","Softwood",0.52,36.341760000000001,50,null,"Spruce, Red","Picea rubens","Softwood",0.4,27.955200000000005,34]
[null,null,null,null,null,null,"Spruce, Sitka","Picea sitchensis","Softwood",0.36,25.159680000000002,33,null,"Custom (optional)","(user selection in input table)","(input)","(input)","(input)","(input)",null,"Pine, Red","Pinus resinosa","Softwood",0.46,32.148480000000006,42,null,"Spruce, White","Picea glauca","Softwood",0.4,27.955200000000005,35]
[null,null,null,null,null,null,"Tanoak","Notholithocarpus densiflorus","Hardwood",0.62,43.330560000000006,65,null,null,null,null,null,null,null,null,"Pine, Virginia","Pinus virginiana","Softwood",0.48,33.546240000000004,50,null,"Sycamore, American","Platanus occidentalis","Hardwood",0.49,34.245120000000007,52]
[null,null,null,null,null,null,"Willow, Black","Salix nigra","Hardwood",0.39,27.256320000000002,51,null,null,null,null,null,null,null,null,"Spruce, Black","Picea mariana","Softwood",0.46,32.148480000000006,35,null,"Tamarack","Larix laricina","Softwood",0.53,37.040640000000003,47]
[null,null,null,null,null,null,"Custom (optional)","(user selection in input table)","(input)","(input)","(input)","(input)",null,"Common Trees in South Central Region",null,null,null,null,null,null,"Spruce, White","Picea glauca","Softwood",0.4,27.955200000000005,35,null,"Tupelo, Black","Nyssa sylvatica","Hardwood",0.5,34.944000000000003,56]
[null,null,null,null,null,null,null,null,null,null,null,null,null,"Common Name","Scientific Name","Type","SGT","gTd (lb/ft3)","gTgr (lb/ft3)",null,"Sweetgum, American","Liquidambar styraciflua","Hardwood",0.52,36.341760000000001,50,null,"Walnut, Black","Juglans nigra","Hardwood",0.55000000000000004,38.438400000000001,57]
[null,null,null,null,null,null,null,null,null,null,null,null,null,"Ash, Blue","Fraxinus quadrangulata","Hardwood",0.57999999999999996,{"$f":"Q61*62.4*1.12","v":40.535040000000002},50,null,"Sycamore, American","Platanus occidentalis","Hardwood",0.49,34.245120000000007,52,null,"Willow, Black","Salix nigra","Hardwood",0.39,27.256320000000002,51]
[null,null,null,null,null,null,"Common Trees in Mountain West Region",null,null,null,null,null,null,"Ash, Green","Fraxinus pennsylvanica","Hardwood",0.56000000000000005,39.137280000000004,52,null,"Tamarack","Larix laricina","Softwood",0.53,37.040640000000003,47,null,"Custom (optional)","(user selection in input table)","(input)","(input)","(input)","(input)"]
[null,null,null,null,null,null,"Common Name","Scientific Name","Type","SGT","gTd (lb/ft3)","gTgr (lb/ft3)",null,"Ash, White","Fraxinus americana","Hardwood",0.6,41.9328,50,null,"Tupelo, Black","Nyssa sylvatica","Hardwood",0.5,34.944000000000003,56]
[null,null,null,null,null,null,"Ash, Green","Fraxinus pennsylvanica","Hardwood",0.56000000000000005,{"$f":"J64*62.4*1.12","v":39.137280000000004},52,null,"Aspen, Bigtooth","Populus grandidentata","Hardwood",0.39,27.256320000000002,43,null,"Walnut, Black","Juglans nigra","Hardwood",0.55000000000000004,38.438400000000001,57]
[null,null,null,null,null,null,"Aspen, Quaking","Populus tremuloides","Hardwood",0.38,26.557440000000003,50,null,"Baldcypress","Taxodium distichum","Softwood",0.46,32.148480000000006,51,null,"Willow, Black","Salix nigra","Hardwood",0.39,27.256320000000002,51,null,"Common Trees in Mid-Atlantic Region"]
[null,null,null,null,null,null,"Balsam poplar (cottonwood)","Populus balsamifera","Hardwood",0.34,23.761920000000003,40,null,"Basswood, American","Tilia americana","Hardwood",0.37,25.858560000000004,41,null,"Custom (optional)","(user selection in input table)","(input)","(input)","(input)","(input)",null,"Common Name","Scientific Name","Type","SGT","gTd (lb/ft3)","gTgr (lb/ft3)"]
[null,null,null,null,null,null,"Birch, Paper","Betula papyrifera","Hardwood",0.55000000000000004,38.438400000000001,52,null,"Beech, American","Fagus grandifolia","Hardwood",0.64,44.728320000000004,54,null,null,null,null,null,null,null,null,"Ash, Green","Fraxinus pennsylvanica","Hardwood",0.56000000000000005,{"$f":"AE67*62.4*1.12","v":39.137280000000004},52]
[null,null,null,null,null,null,"Cedar, Western redcedar","Thuja plicata","Softwood",0.32,22.364160000000002,27,null,"Birch, Sweet","Betula lenta","Hardwood",0.65,45.427200000000006,65,null,null,null,null,null,null,null,null,"Ash, White","Fraxinus americana","Hardwood",0.6,41.9328,50]
[null,null,null,null,null,null,"Cherry, Black","Prunus serotina","Hardwood",0.5,34.944000000000003,45,null,"Birch, Yellow","Betula alleghaniensis","Hardwood",0.62,43.330560000000006,59,null,"Common Trees in Southeast Region",null,null,null,null,null,null,"Aspen, Bigtooth","Populus grandidentata","Hardwood",0.39,27.256320000000002,43]
[null,null,null,null,null,null,"Cottonwood, Black","Populus trichocarpa","Hardwood",0.35,24.460800000000003,46,null,"Butternut","Juglans cinerea","Hardwood",0.38,26.557440000000003,46,null,"Common Name","Scientific Name","Type","SGT","gTd (lb/ft3)","gTgr (lb/ft3)",null,"Aspen, Quaking","Populus tremuloides","Hardwood",0.38,26.557440000000003,50]
[null,null,null,null,null,null,"Cottonwood, Eastern","Populus deltoides","Hardwood",0.4,27.955200000000005,50,null,"Cedar, Eastern redcedar","Juniperus virginiana","Softwood",0.47,32.847360000000002,37,null,"Ash, Green","Fraxinus pennsylvanica","Hardwood",0.56000000000000005,{"$f":"X71*62.4*1.12","v":39.137280000000004},52,null,"Baldcypress","Taxodium distichum","Softwood",0.46,32.148480000000006,51]
[null,null,null,null,null,null,"Douglas-fir, Interior north","Pseudotsuga menziesii var. glauca","Softwood",0.48,33.546240000000004,38,null,"Cherry, Black","Prunus serotina","Hardwood",0.5,34.944000000000003,45,null,"Ash, White","Fraxinus americana","Hardwood",0.6,41.9328,50,null,"Basswood, American","Tilia americana","Hardwood",0.37,25.858560000000004,41]
[null,null,null,null,null,null,"Douglas-fir, Interior south","Pseudotsuga menziesii var. glauca","Softwood",0.46,32.148480000000006,37,null,"Chestnut, American","Castanea dentata","Hardwood",0.43,30.051840000000002,55,null,"Baldcypress","Taxodium distichum","Softwood",0.46,32.148480000000006,51,null,"Beech, American","Fagus grandifolia","Hardwood",0.64,44.728320000000004,54]
[null,null,null,null,null,null,"Fir, Grand","Abies grandis","Softwood",0.37,25.858560000000004,45,null,"Cottonwood, Eastern","Populus deltoides","Hardwood",0.4,27.955200000000005,50,null,"Basswood, American","Tilia americana","Hardwood",0.37,25.858560000000004,41,null,"Birch, Sweet","Betula lenta","Hardwood",0.65,45.427200000000006,65]
[null,null,null,null,null,null,"Fir, Subalpine","Abies lasiocarpa","Softwood",0.32,22.364160000000002,28,null,"Cucumbertree (magnolia)","Magnolia acuminata","Hardwood",0.48,33.546240000000004,48,null,"Beech, American","Fagus grandifolia","Hardwood",0.64,44.728320000000004,54,null,"Birch, Yellow","Betula alleghaniensis","Hardwood",0.62,43.330560000000006,59]
[null,null,null,null,null,null,"Fir, White","Abies concolor","Softwood",0.39,27.256320000000002,47,null,"Elm, American","Ulmus americana","Hardwood",0.5,34.944000000000003,56,null,"Birch, Sweet","Betula lenta","Hardwood",0.65,45.427200000000006,65,null,"Butternut","Juglans cinerea","Hardwood",0.38,26.557440000000003,46]
[null,null,null,null,null,null,"Hemlock, Mountain","Tsuga mertensiana","Softwood",0.45,31.4496,44,null,"Elm, Rock","Ulmus thomasii","Hardwood",0.63,44.029440000000001,54,null,"Birch, Yellow","Betula alleghaniensis","Hardwood",0.62,43.330560000000006,59,null,"Cedar, Atlantic white","Chamaecyparis thyoides","Softwood",0.32,22.364160000000002,36]
[null,null,null,null,null,null,"Hemlock, Western","Tsuga heterophylla","Softwood",0.45,31.4496,41,null,"Elm, Slippery","Ulmus rubra","Hardwood",0.53,37.040640000000003,53,null,"Butternut","Juglans cinerea","Hardwood",0.38,26.557440000000003,46,null,"Cedar, Eastern redcedar","Juniperus virginiana","Softwood",0.47,32.847360000000002,37]
[null,null,null,null,null,null,"Larch, Western","Larix occidentalis","Softwood",0.52,36.341760000000001,48,null,"Hackberry","Celtis occidentalis","Hardwood",0.53,37.040640000000003,50,null,"Cedar, Atlantic white","Chamaecyparis thyoides","Softwood",0.32,22.364160000000002,36,null,"Cherry, Black","Prunus serotina","Hardwood",0.5,34.944000000000003,45]
[null,null,null,null,null,null,"Pine, Lodgepole","Pinus contorta","Softwood",0.41,28.654080000000004,39,null,"Hemlock, Eastern","Tsuga canadensis","Softwood",0.4,27.955200000000005,50,null,"Cedar, Eastern redcedar","Juniperus virginiana","Softwood",0.47,32.847360000000002,37,null,"Chestnut, American","Castanea dentata","Hardwood",0.43,30.051840000000002,55]
[null,null,null,null,null,null,"Pine, Ponderosa","Pinus ponderosa","Softwood",0.4,27.955200000000005,45,null,"Hickory, Bitternut","Carya cordiformis","Hardwood",0.66,46.126080000000002,64,null,"Cherry, Black","Prunus serotina","Hardwood",0.5,34.944000000000003,45,null,"Cottonwood, Eastern","Populus deltoides","Hardwood",0.4,27.955200000000005,50]
[null,null,null,null,null,null,"Pine, Western white","Pinus monticola","Softwood",0.38,26.557440000000003,35,null,"Hickory, Mockernut","Carya tomentosa","Hardwood",0.72,50.319360000000003,65,null,"Chestnut, American","Castanea dentata","Hardwood",0.43,30.051840000000002,55,null,"Cucumbertree (magnolia)","Magnolia acuminata","Hardwood",0.48,33.546240000000004,48]
[null,null,null,null,null,null,"Spruce, Engelmann","Picea engelmannii","Softwood",0.35,24.460800000000003,39,null,"Hickory, Nutmeg","Carya myristiciformis","Hardwood",0.6,41.9328,62,null,"Cottonwood, Eastern","Populus deltoides","Hardwood",0.4,27.955200000000005,50,null,"Elm, American","Ulmus americana","Hardwood",0.5,34.944000000000003,56]
[null,null,null,null,null,null,"Willow, Black","Salix nigra","Hardwood",0.39,27.256320000000002,51,null,"Hickory, Pignut","Carya glabra","Hardwood",0.75,52.416000000000004,68,null,"Cucumbertree (magnolia)","Magnolia acuminata","Hardwood",0.48,33.546240000000004,48,null,"Elm, Slippery","Ulmus rubra","Hardwood",0.53,37.040640000000003,53]
[null,null,null,null,null,null,"Custom (optional)","(user selection in input table)","(input)","(input)","(input)","(input)",null,"Hickory, Shagbark","Carya ovata","Hardwood",0.72,50.319360000000003,64,null,"Elm, American","Ulmus americana","Hardwood",0.5,34.944000000000003,56,null,"Hackberry","Celtis occidentalis","Hardwood",0.53,37.040640000000003,50]
[null,null,null,null,null,null,null,null,null,null,null,null,null,"Hickory, Shellbark","Carya laciniosa","Hardwood",0.69,48.222720000000002,64,null,"Elm, Slippery","Ulmus rubra","Hardwood",0.53,37.040640000000003,53,null,"Hemlock, Eastern","Tsuga canadensis","Softwood",0.4,27.955200000000005,50]
[null,null,null,null,null,null,null,null,null,null,null,null,null,"Hickory, Water","Carya aquatica","Hardwood",0.62,43.330560000000006,70,null,"Hackberry","Celtis occidentalis","Hardwood",0.53,37.040640000000003,50,null,"Hickory, Bitternut","Carya cordiformis","Hardwood",0.66,46.126080000000002,64]
[null,null,null,null,null,null,null,null,null,null,null,null,null,"Honey locust","Gleditsia triacanthos","Hardwood",0.65,45.427200000000006,60,null,"Hemlock, Eastern","Tsuga canadensis","Softwood",0.4,27.955200000000005,50,null,"Hickory, Mockernut","Carya tomentosa","Hardwood",0.72,50.319360000000003,65]
[null,null,null,null,null,null,null,null,null,null,null,null,null,"Locust, Black","Robinia pseudoacacia","Hardwood",0.69,48.222720000000002,58,null,"Hickory, Bitternut","Carya cordiformis","Hardwood",0.66,46.126080000000002,64,null,"Hickory, Pignut","Carya glabra","Hardwood",0.75,52.416000000000004,68]
[null,null,null,null,null,null,null,null,null,null,null,null,null,"Magnolia, Southern","Magnolia grandiflora","Hardwood",0.5,34.944000000000003,59,null,"Hickory, Mockernut","Carya tomentosa","Hardwood",0.72,50.319360000000003,65,null,"Hickory, Shagbark","Carya ovata","Hardwood",0.72,50.319360000000003,64]
[null,null,null,null,null,null,null,null,null,null,null,null,null,"Maple, Black","Acer nigrum","Hardwood",0.56999999999999995,39.83616,55,null,"Hickory, Nutmeg","Carya myristiciformis","Hardwood",0.6,41.9328,62,null,"Locust, Black","Robinia pseudoacacia","Hardwood",0.69,48.222720000000002,58]
[null,null,null,null,null,null,null,null,null,null,null,null,null,"Maple, Red","Acer rubrum","Hardwood",0.54,37.739519999999999,50,null,"Hickory, Pignut","Carya glabra","Hardwood",0.75,52.416000000000004,68,null,"Maple, Red","Acer rubrum","Hardwood",0.54,37.739519999999999,50]
[null,null,null,null,null,null,null,null,null,null,null,null,null,"Maple, Silver","Acer saccharinum","Hardwood",0.47,{"$f":"Q93*62.4*1.12","v":32.847360000000002},46,null,"Hickory, Shagbark","Carya ovata","Hardwood",0.72,50.319360000000003,64,null,"Maple, Silver","Acer saccharinum","Hardwood",0.47,32.847360000000002,46]
[null,null,null,null,null,null,null,null,null,null,null,null,null,"Maple, Sugar","Acer saccharum","Hardwood",0.63,44.029440000000001,55,null,"Hickory, Water","Carya aquatica","Hardwood",0.62,43.330560000000006,70,null,"Maple, Sugar","Acer saccharum","Hardwood",0.63,44.029440000000001,55]
[null,null,null,null,null,null,null,null,null,null,null,null,null,"Oak, Black","Quercus velutina","Hardwood",0.61,42.631680000000003,64,null,"Locust, Black","Robinia pseudoacacia","Hardwood",0.69,48.222720000000002,58,null,"Oak, Black","Quercus velutina","Hardwood",0.61,42.631680000000003,64]
[null,null,null,null,null,null,null,null,null,null,null,null,null,"Oak, Bur","Quercus macrocarpa","Hardwood",0.64,44.728320000000004,63,null,"Magnolia, Southern","Magnolia grandiflora","Hardwood",0.5,34.944000000000003,59,null,"Oak, Cherrybark","Quercus pagoda","Hardwood",0.69,48.222720000000002,64]
[null,null,null,null,null,null,null,null,null,null,null,null,null,"Oak, Cherrybark","Quercus pagoda","Hardwood",0.69,48.222720000000002,64,null,"Maple, Red","Acer rubrum","Hardwood",0.54,37.739519999999999,50,null,"Oak, Chestnut","Quercus prinus","Hardwood",0.66,46.126080000000002,63]
[null,null,null,null,null,null,null,null,null,null,null,null,null,"Oak, Chestnut","Quercus prinus","Hardwood",0.66,46.126080000000002,63,null,"Maple, Silver","Acer saccharinum","Hardwood",0.47,32.847360000000002,46,null,"Oak, Laurel","Quercus laurifolia","Hardwood",0.63,44.029440000000001,64]
[null,null,null,null,null,null,null,null,null,null,null,null,null,"Oak, Laurel","Quercus laurifolia","Hardwood",0.63,44.029440000000001,64,null,"Oak, Black","Quercus velutina","Hardwood",0.61,42.631680000000003,64,null,"Oak, Northern red","Quercus rubra","Hardwood",0.63,{"$f":"AE99*62.4*1.12","v":44.029440000000001},64]
[null,null,null,null,null,null,null,null,null,null,null,null,null,"Oak, Northern red","Quercus rubra","Hardwood",0.63,44.029440000000001,64,null,"Oak, Cherrybark","Quercus pagoda","Hardwood",0.69,48.222720000000002,64,null,"Oak, Overcup","Quercus lyrata","Hardwood",0.63,44.029440000000001,63]
[null,null,null,null,null,null,null,null,null,null,null,null,null,"Oak, Overcup","Quercus lyrata","Hardwood",0.63,44.029440000000001,63,null,"Oak, Chestnut","Quercus prinus","Hardwood",0.66,46.126080000000002,63,null,"Oak, Pin","Quercus palustris","Hardwood",0.63,44.029440000000001,64]
[null,null,null,null,null,null,null,null,null,null,null,null,null,"Oak, Pin","Quercus palustris","Hardwood",0.63,44.029440000000001,64,null,"Oak, Laurel","Quercus laurifolia","Hardwood",0.63,44.029440000000001,64,null,"Oak, Post ","Quercus stellata","Hardwood",0.67,46.824960000000004,64]
[null,null,null,null,null,null,null,null,null,null,null,null,null,"Oak, Post ","Quercus stellata","Hardwood",0.67,46.824960000000004,64,null,"Oak, Northern red","Quercus rubra","Hardwood",0.63,{"$f":"X103*62.4*1.12","v":44.029440000000001},64,null,"Oak, Scarlet","Quercus coccinea","Hardwood",0.67,46.824960000000004,64]
[null,null,null,null,null,null,null,null,null,null,null,null,null,"Oak, Scarlet","Quercus coccinea","Hardwood",0.67,46.824960000000004,64,null,"Oak, Overcup","Quercus lyrata","Hardwood",0.63,44.029440000000001,63,null,"Oak, Southern red","Quercus falcata","Hardwood",0.59,41.233919999999998,64]
[null,null,null,null,null,null,null,null,null,null,null,null,null,"Oak, Southern live","Quercus virginiana","Hardwood",0.88,61.501440000000002,76,null,"Oak, Pin","Quercus palustris","Hardwood",0.63,44.029440000000001,64,null,"Oak, Swamp chestnut","Quercus michauxii","Hardwood",0.67,46.824960000000004,63]
[null,null,null,null,null,null,null,null,null,null,null,null,null,"Oak, Southern red","Quercus falcata","Hardwood",0.59,41.233919999999998,64,null,"Oak, Post ","Quercus stellata","Hardwood",0.67,46.824960000000004,64,null,"Oak, Swamp white","Quercus bicolor","Hardwood",0.72,50.319360000000003,63]
[null,null,null,null,null,null,null,null,null,null,null,null,null,"Oak, Swamp chestnut","Quercus michauxii","Hardwood",0.67,46.824960000000004,63,null,"Oak, Scarlet","Quercus coccinea","Hardwood",0.67,46.824960000000004,64,null,"Oak, Water","Quercus nigra","Hardwood",0.63,44.029440000000001,64]
[null,null,null,null,null,null,null,null,null,null,null,null,null,"Oak, Swamp white","Quercus bicolor","Hardwood",0.72,50.319360000000003,63,null,"Oak, Southern live","Quercus virginiana","Hardwood",0.88,61.501440000000002,76,null,"Oak, White","Quercus alba","Hardwood",0.68,47.523840000000007,63]
[null,null,null,null,null,null,null,null,null,null,null,null,null,"Oak, Water","Quercus nigra","Hardwood",0.63,44.029440000000001,64,null,"Oak, Southern red","Quercus falcata","Hardwood",0.59,41.233919999999998,64,null,"Oak, Willow","Quercus phellos","Hardwood",0.69,48.222720000000002,64]
[null,null,null,null,null,null,null,null,null,null,null,null,null,"Oak, White","Quercus alba","Hardwood",0.68,47.523840000000007,63,null,"Oak, Swamp chestnut","Quercus michauxii","Hardwood",0.67,46.824960000000004,63,null,"Pine, Eastern white","Pinus strobus","Softwood",0.35,24.460800000000003,35]
[null,null,null,null,null,null,null,null,null,null,null,null,null,"Oak, Willow","Quercus phellos","Hardwood",0.69,48.222720000000002,64,null,"Oak, Water","Quercus nigra","Hardwood",0.63,44.029440000000001,64,null,"Pine, Loblolly","Pinus taeda","Softwood",0.51,35.642879999999998,53]
[null,null,null,null,null,null,null,null,null,null,null,null,null,"Pecan (hickory)","Carya illinoinensis","Hardwood",0.66,46.126080000000002,62,null,"Oak, White","Quercus alba","Hardwood",0.68,47.523840000000007,63,null,"Pine, Pitch","Pinus rigida","Softwood",0.52,36.341760000000001,50]
[null,null,null,null,null,null,null,null,null,null,null,null,null,"Pine, Eastern white","Pinus strobus","Softwood",0.35,24.460800000000003,35,null,"Oak, Willow","Quercus phellos","Hardwood",0.69,48.222720000000002,64,null,"Pine, Pond","Pinus serotina","Softwood",0.56000000000000005,39.137280000000004,51]
[null,null,null,null,null,null,null,null,null,null,null,null,null,"Pine, Loblolly","Pinus taeda","Softwood",0.51,35.642879999999998,53,null,"Pine, Eastern white","Pinus strobus","Softwood",0.35,24.460800000000003,35,null,"Pine, Shortleaf","Pinus echinata","Softwood",0.51,35.642879999999998,52]
[null,null,null,null,null,null,null,null,null,null,null,null,null,"Pine, Longleaf","Pinus palustris","Softwood",0.59,41.233919999999998,55,null,"Pine, Loblolly","Pinus taeda","Softwood",0.51,35.642879999999998,53,null,"Pine, Virginia","Pinus virginiana","Softwood",0.48,33.546240000000004,50]
[null,null,null,null,null,null,null,null,null,null,null,null,null,"Pine, Pitch","Pinus rigida","Softwood",0.52,36.341760000000001,50,null,"Pine, Longleaf","Pinus palustris","Softwood",0.59,41.233919999999998,55,null,"Sweetgum, American","Liquidambar styraciflua","Hardwood",0.52,36.341760000000001,50]
[null,null,null,null,null,null,null,null,null,null,null,null,null,"Pine, Shortleaf","Pinus echinata","Softwood",0.51,35.642879999999998,52,null,"Pine, Pitch","Pinus rigida","Softwood",0.52,36.341760000000001,50,null,"Sycamore, American","Platanus occidentalis","Hardwood",0.49,34.245120000000007,52]
[null,null,null,null,null,null,null,null,null,null,null,null,null,"Pine, Slash","Pinus elliottii","Softwood",0.59,41.233919999999998,58,null,"Pine, Pond","Pinus serotina","Softwood",0.56000000000000005,39.137280000000004,51,null,"Tupelo, Black","Nyssa sylvatica","Hardwood",0.5,34.944000000000003,56]
[null,null,null,null,null,null,null,null,null,null,null,null,null,"Pine, Spruce","Pinus glabra","Softwood",0.44,30.750720000000001,45,null,"Pine, Sand","Pinus clausa","Softwood",0.48,33.546240000000004,38,null,"Walnut, Black","Juglans nigra","Hardwood",0.55000000000000004,38.438400000000001,57]
[null,null,null,null,null,null,null,null,null,null,null,null,null,"Pine, Virginia","Pinus virginiana","Softwood",0.48,33.546240000000004,50,null,"Pine, Shortleaf","Pinus echinata","Softwood",0.51,35.642879999999998,52,null,"Willow, Black","Salix nigra","Hardwood",0.39,27.256320000000002,51]
[null,null,null,null,null,null,null,null,null,null,null,null,null,"Sweetgum, American","Liquidambar styraciflua","Hardwood",0.52,36.341760000000001,50,null,"Pine, Slash","Pinus elliottii","Softwood",0.59,41.233919999999998,58,null,"Custom (optional)","(user selection in input table)","(input)","(input)","(input)","(input)"]
[null,null,null,null,null,null,null,null,null,null,null,null,null,"Sycamore, American","Platanus occidentalis","Hardwood",0.49,34.245120000000007,52,null,"Pine, Spruce","Pinus glabra","Softwood",0.44,30.750720000000001,45]
[null,null,null,null,null,null,null,null,null,null,null,null,null,"Tupelo, Black","Nyssa sylvatica","Hardwood",0.5,34.944000000000003,56,null,"Pine, Virginia","Pinus virginiana","Softwood",0.48,33.546240000000004,50]
[null,null,null,null,null,null,null,null,null,null,null,null,null,"Tupelo, Water","Nyssa aquatica","Hardwood",0.5,34.944000000000003,56,null,"Sweetgum, American","Liquidambar styraciflua","Hardwood",0.52,36.341760000000001,50]
[null,null,null,null,null,null,null,null,null,null,null,null,null,"Walnut, Black","Juglans nigra","Hardwood",0.55000000000000004,{"$f":"Q125*62.4*1.12","v":38.438400000000001},57,null,"Sycamore, American","Platanus occidentalis","Hardwood",0.49,34.245120000000007,52]
[null,null,null,null,null,null,null,null,null,null,null,null,null,"Willow, Black","Salix nigra","Hardwood",0.39,{"$f":"Q126*62.4*1.12","v":27.256320000000002},51,null,"Tupelo, Black","Nyssa sylvatica","Hardwood",0.5,34.944000000000003,56]
[null,null,null,null,null,null,null,null,null,null,null,null,null,"Custom (optional)","(user selection in input table)","(input)","(input)","(input)","(input)",null,"Tupelo, Water","Nyssa aquatica","Hardwood",0.5,34.944000000000003,56]
[null,null,null,null,null,null,null,null,null,null,null,null,null,null,null,null,null,null,null,null,"Walnut, Black","Juglans nigra","Hardwood",0.55000000000000004,38.438400000000001,57]
[null,null,null,null,null,null,null,null,null,null,null,null,null,null,null,null,null,null,null,null,"Willow, Black","Salix nigra","Hardwood",0.39,27.256320000000002,51]
[null,null,null,null,null,null,null,null,null,null,null,null,null,null,null,null,null,null,null,null,"Custom (optional)","(user selection in input table)","(input)","(input)","(input)","(input)"]

{"sheet":"6-Single Log Design","index":6,"n_rows":245,"n_cols":72,"rows_kept":245,"cut":false,"hidden":false,"merged":[[109,31,109,32],[102,31,102,32],[6,11,6,12],[7,11,7,12],[8,11,8,12],[9,11,9,12],[10,11,10,12],[11,11,11,12],[12,11,12,12],[7,18,7,20],[13,13,13,16],[75,15,75,16],[44,23,45,23],[44,25,45,25],[74,18,74,20],[44,24,45,24],[90,29,90,30],[90,31,90,32],[90,27,90,28],[102,27,102,28],[86,20,86,21],[83,19,83,23],[83,18,84,18],[85,20,85,21],[87,20,87,21],[56,0,56,4],[63,0,63,5],[27,1,27,2],[28,1,28,2],[47,1,47,2],[5,13,5,16],[6,13,6,16],[7,13,7,16],[8,13,8,16],[9,13,9,16],[10,13,10,16],[11,13,11,16],[12,13,12,16],[10,0,10,2],[23,3,23,4],[20,0,20,2],[21,0,21,2],[13,11,13,12],[83,27,84,27],[41,34,41,38],[4,32,5,35],[5,28,5,30],[83,28,83,31],[28,18,28,22],[7,22,7,24],[17,43,17,44],[22,43,22,44],[27,43,27,44],[13,28,13,30],[33,43,33,44],[29,19,30,19],[10,28,10,30],[17,32,17,33],[22,32,22,33],[16,18,16,20],[42,34,42,40],[42,41,42,49],[54,18,54,22],[55,19,56,19],[55,20,55,23],[44,29,44,31],[90,1,90,2],[80,0,80,4],[84,0,84,9],[79,0,79,9],[64,7,64,9],[73,0,73,9],[62,0,62,9],[74,3,74,6],[67,0,67,2],[80,7,80,9],[67,3,67,5],[77,3,77,4],[4,60,4,63],[74,7,74,9],[0,8,1,9],[2,0,2,9],[4,1,4,2],[4,3,4,4],[5,1,5,2],[5,3,5,4],[52,7,52,9],[17,22,17,27],[64,26,65,26],[24,3,24,4],[23,0,24,0],[27,32,27,33],[44,26,45,26],[66,10,69,10],[4,11,4,12],[5,11,5,12],[4,43,5,46],[37,27,38,27],[38,45,38,48],[48,0,48,9],[49,0,49,5],[49,7,49,8],[107,27,107,28],[90,20,90,24],[91,14,91,25],[97,20,97,22],[91,0,91,9],[7,0,8,0],[74,0,74,2],[4,54,4,59],[5,54,5,55],[26,1,26,2],[51,13,51,14],[38,34,38,37],[33,32,33,33],[83,25,84,25],[64,21,64,22],[64,23,65,23],[64,24,65,24],[64,25,65,25],[84,20,84,21],[50,13,50,14],[37,26,38,26],[29,20,29,23],[74,22,74,30],[44,21,44,22]]}
[{"$f":"'1-Cover'!A1","v":"Project Name"},null,null,null,null,null,null,null,"Spreadsheet developed by Michael Rafferty, P.E."]
[]
["Single Log Stability Analysis Model Inputs",null,null,null,null,null,null,null,null,null,"ERROR CHECKS"]
[]
["Site ID","Structure Type",null,"Structure Position",null,"Meander","Station","dw (ft)","Rc/WBF","udes (ft/s)",null,"Type Lookup Table",null,null,null,null,null,null,null,null,null,null,null,null,null,null,null,null,null,null,null,null,"Tilted Cylindrical (Stem) \"Below Water Surface\" Volume Calculation (Below High Flow)",null,null,null,null,null,null,null,null,null,null,"Tilted Cylindrical (Stem) Wet Volume Calculation (Below Channel Thalweg)",null,null,null,null,null,null,null,null,null,null,"Tilted Frustum (RW) Volume Calculation (Slice Method)",null,null,null,null,null,"A = R2 arccos [(R - h)/R] - [(R - h)*SQRT(2Rh - h2)]"]
[null,null,null,null,null,null,{"$f":"IF($A6=\"\",\"\",VLOOKUP($A6,SiteInfo,2,0))","v":""},{"$f":"IF($A6=\"\",\"\",VLOOKUP($A6,SiteInfo,4,0))","v":""},{"$f":"IF($A6=\"\",\"\",VLOOKUP($A6,SiteInfo,9,0))","v":""},{"$f":"IF(OR($A$6=\"\",$F$6=\"\"),\"\",IF($F$6=\"Outside\",VLOOKUP($A$6,SiteInfo,10,0),VLOOKUP($A$6,SiteInfo,5,0)))","v":""},{"$f":"IF($F$6=\"\",\"\",IF(AND($I$6<26,$F$6=\"Straight\"),\"CHECK - Structure is located on a meander (Rc/WBF < 26)\",\"\"))","v":""},"Structure Types",null,"Description",null,null,null,null,null,null,null,null,null,null,null,null,null,null,"Water Surface",null,null,null,null,null,null,null,null,null,null,null,null,null,null,null,null,null,null,null,null,null,null,null,null,null,"Slice thickness (ft) =",null,{"$f":"IF($G$22=\"\",\"\",$G$22/$BC$39)","v":0},"WSE (ft) =",{"$f":"IF($AE$8=\"\",\"\",$AE$8)","v":0},"RRW (ft) =",{"$f":"IF($H$22=\"\",\"\",$H$22/2)","v":0},"yRW,crown (ft) =",{"$f":"IF($U$10=\"\",\"\",$U$10)","v":0},"yRW,bot (ft) =",{"$f":"IF($U$15=\"\",\"\",$U$15)","v":0}]
[null,null,null,null,null,null,null,null,null,null,{"$f":"IF(OR($F$6=\"\",$I$6=\"\"),\"\",IF(AND($I$6>26,$F$6<>\"Straight\"),\"CHECK - Structure is not on a meander (Rc/WBF > 26)\",\"\"))","v":""},"Rootwad",null,"Logs buried in bank with rootwads protruding into channel",null,null,null,null,null,null,null,null,null,null,null,null,null,null,null,"x (ft)","y (ft)",null,null,"R = DTS/2",{"$f":"$F$22/2","v":0},"ft",null,null,null,null,null,null,null,null,"R = DTS/2",{"$f":"$F$22/2","v":0},"ft",null,null,null,null,null,null,null,null,null,null,"Thalweg Elevation (ft) =",{"$f":"$C$16","v":0},"RTS (ft) =",{"$f":"IF($F$22=\"\",\"\",$F$22/2)","v":""},"yRC,crown (ft) =",{"$f":"IF($U$11=\"\",\"\",$U$11)","v":0},"yRC,bot (ft) =",{"$f":"IF($U$14=\"\",\"\",$U$14)","v":0}]
["Multi-Log Structures","Layer","Log ID",null,null,null,null,null,null,null,null,"Log Vane",null,"Logs protruding from bank and angled either up- or downstream",null,null,null,null,"Large Wood Coordinates",null,null,null,null,null,null,null,null,null,"WSE",{"$f":"IF(OR($A$6=\"\",$C$16=\"\"),0,IF(($H$6+$C$16)>=$C$13,$B$13,IF(AND(($H$6+$C$16)<$C$13,($H$6+$C$16)>=$C$14),((($C$13-($H$6+$C$16))/($C$13-$C$14))*($B$14-$B$13))+$B$13,IF(AND(($H$6+$C$16)<$C$14,($H$6+$C$16)>=$C$15),((($C$14-($H$6+$C$16))/($C$14-$C$15))*($B$15-$B$14))+$B$14,IF(AND(($H$6+$C$16)<$C$15,($H$6+$C$16)>=$C$16),((($C$15-($H$6+$C$16))/($C$15-$C$16))*($B$16-$B$15))+$B$15,\"\")))))","v":0},{"$f":"IF(OR($A$6=\"\",$C$16=\"\"),$C$13,$H$6+$C$16)","v":0},null,null,"b (rad)",{"$f":"ABS($C$25)*PI()/180","v":0},"rad",null,null,null,null,null,null,null,null,"b (rad)",{"$f":"ABS($C$25)*PI()/180","v":0},"rad"]
[null,null,null,null,null,null,null,null,null,null,null,"Log Weir",null,"Weirs spanning small streams comprised of one or more large logs",null,null,null,null,null,"x (ft)","y (ft)",null,"Large wood check","x (ft)",null,"y (ft)",null,null,"WSE",{"$f":"IF(OR($A$6=\"\",$C$16=\"\"),0,IF(($H$6+$C$16)>=$C$19,$B$19,IF(AND(($H$6+$C$16)<$C$19,($H$6+$C$16)>=$C$18),(((($H$6+$C$16)-$C$18)/($C$19-$C$18))*($B$19-$B$18))+$B$18,IF(AND(($H$6+$C$16)<$C$18,($H$6+$C$16)>=$C$17),(((($H$6+$C$16)-$C$17)/($C$18-$C$17))*($B$18-$B$17))+$B$17,IF(AND(($H$6+$C$16)<$C$17,($H$6+$C$16)>=$C$16),(((($H$6+$C$16)-$C$16)/($C$17-$C$16))*($B$17-$B$16))+$B$16,\"\")))))","v":0},{"$f":"IF(OR($A$6=\"\",$C$16=\"\"),$C$13,$H$6+$C$16)","v":0},null,null,"dwet,max",{"$f":"IF($AB$23>$AB$24,$AB$23,IF($AB$23<$AB$24,$AB$24,\"\"))","v":""},"ft",null,null,null,null,null,null,null,null,"dwet,max",{"$f":"IF($Z$23>$Z$24,$Z$23,IF($Z$23<$Z$24,$Z$24,\"\"))","v":""},"ft",null,null,null,null,null,null,null,"Slice #","xRW,avg (ft)","RRW,slice (ft)","Aslice,avg (ft)","Vslice (ft3)","ycrown,avg (ft)","ybot,avg (ft)","hRW,cr,↑WSE (ft)","ARW,↑WSE (ft2)","VRW,↑WSE (ft3)","hRW,bot,↓thw (ft)","ARW,↓thw (ft2)","VRW,↓thw (ft3)"]
[null,null,null,null,null,null,null,null,null,null,{"$f":"IF(OR($C$14=\"\",$C$15=\"\"),\"\",IF($C$15>=$C$14,\"ERROR - LB top elevation must be > LB toe elevation\",\"\"))","v":""},"Tree Revetment",null,"Row of logs secured along the bank and placed parallel to flow",null,null,null,"Pt 1","Rootwad: Crown",{"$f":"IF($F$25=\"\",0,IF($D$25=\"Rootwad: Crown\",$F$25,IF($D$22=\"No\",$T$15+(($F$22*-$M$20)*$M$17),$T$15+(($H$22*-$M$20)*$M$17))))","v":0},{"$f":"IF($G$25=\"\",$C$13,IF($D$25=\"Rootwad: Crown\",$G$25,IF($D$22=\"No\",$U$15+($F$22*$M$19),$U$15+($H$22*$M$19))))","v":0},null,"Rootwad: Crown",{"$f":"IF($D$22=\"No\",$T$15+(($F$22*-$M$20)*$M$17),$T$15+(($H$22*-$M$20)*$M$17))","v":0},{"$f":"IF(X10=T10,\"OK\",\"ERROR\")","v":"OK"},{"$f":"IF($D$22=\"No\",$U$15+($F$22*$M$19),$U$15+($H$22*$M$19))","v":0},{"$f":"IF(Z10=U10,\"OK\",\"ERROR\")","v":"OK"},null,null,null,null,null,null,"dwet,avgH",{"$f":"IF(AND($AB$23>0,$AB$24>0),(($AB$23/COS($AI$8))+($AB$24/COS($AI$8)))/2,\"\")","v":""},"ft",null,null,null,null,null,null,null,null,"dwet,avgH",{"$f":"IF(AND($Z$23>0,$Z$24>0),(($Z$23/COS($AT$8))+($Z$24/COS($AT$8)))/2,\"\")","v":""},"ft",null,null,null,null,null,null,null,1,{"$f":"($BE$6/2)+(($BC10-1)*$BE$6)","v":0},{"$f":"(($G$22-$BD10)/$G$22)*($BI$6-$BI$7)+$BI$7","v":{"$error":"#DIV/0!"}},{"$f":"PI()*($BE10^2)","v":{"$error":"#DIV/0!"}},{"$f":"$BF10*$BE$6","v":{"$error":"#DIV/0!"}},{"$f":"(($G$22-$BD10)/$G$22)*($BK$6-$BK$7)+$BK$7","v":{"$error":"#DIV/0!"}},{"$f":"(($G$22-$BD10)/$G$22)*($BM$6-$BM$7)+$BM$7","v":{"$error":"#DIV/0!"}},{"$f":"IF($BH10<=$BG$6,0,IF((($BH10-$BG$6)*$M$19)>=($BE10*2),$BE10*2,($BH10-$BG$6)*$M$19))","v":{"$error":"#DIV/0!"}},{"$f":"(($BE10^2)*ACOS(($BE10-$BJ10)/$BE10))-(($BE10-$BJ10)*SQRT(2*$BE10*$BJ10-($BJ10^2)))","v":{"$error":"#DIV/0!"}},{"$f":"$BK10*$BE$6","v":{"$error":"#DIV/0!"}},{"$f":"IF($BI10>=$BG$7,0,IF((($BG$7-$BI10)*$M$19)>=($BE10*2),$BE10*2,($BG$7-$BI10)*$M$19))","v":{"$error":"#DIV/0!"}},{"$f":"(($BE10^2)*ACOS(($BE10-$BM10)/$BE10))-(($BE10-$BM10)*SQRT(2*$BE10*$BM10-($BM10^2)))","v":{"$error":"#DIV/0!"}},{"$f":"$BN10*$BE$6","v":{"$error":"#DIV/0!"}}]
["Channel Geometry Coordinates",null,null,null,null,null,null,null,null,null,{"$f":"IF(OR($C$15=\"\",$C$16=\"\",$C$17=\"\"),\"\",IF(OR($C$15<$C$16,$C$17<$C$16),\"ERROR - Toe elevation must be >= thalweg elevation\",\"\"))","v":""},"In-Situ",null,"Logs fluvially deposited and fallen trees in contact with the bank",null,null,null,"Pt 2","Root collar: Crown",{"$f":"IF($F$25=\"\",0,IF($D$25=\"Root collar: Crown\",$F$25,IF($D$22=\"No\",$T$10,$T$10+(($G$22*$M$19)*$M$17)-(((($H$22-$F$22)/2)*-$M$20)*$M$17))))","v":0},{"$f":"IF($G$25=\"\",$C$13,IF($D$25=\"Root collar: Crown\",$G$25,IF($D$22=\"No\",$U$10,$U$10-($G$22*-$M$20)-((($H$22-$F$22)/2)*$M$19))))","v":0},null,"Root collar: Crown",{"$f":"IF($D$22=\"No\",$X$10,$T$10+(($G$22*$M$19)*$M$17)-(((($H$22-$F$22)/2)*-$M$20)*$M$17))","v":0},"OK",{"$f":"IF($D$22=\"No\",$Z$10,$U$10-($G$22*-$M$20)-((($H$22-$F$22)/2)*$M$19))","v":0},"OK",null,"Water Surface Label",null,null,null,null,"hmax,lower",{"$f":"IF($AI$9/COS($AI$8)>$F$22,$F$22,$AI$9/COS($AI$8))","v":{"$error":"#VALUE!"}},"ft",null,null,null,null,null,null,null,null,"hmax,lower",{"$f":"IF($AT$9/COS($AT$8)>$F$22,$F$22,$AT$9/COS($AT$8))","v":{"$error":"#VALUE!"}},"ft",null,null,null,null,null,null,null,2,{"$f":"($BE$6/2)+(($BC11-1)*$BE$6)","v":0},{"$error":"#DIV/0!"},{"$f":"PI()*($BE11^2)","v":{"$error":"#DIV/0!"}},{"$f":"$BF11*$BE$6","v":{"$error":"#DIV/0!"}},{"$error":"#DIV/0!"},{"$error":"#DIV/0!"},{"$f":"IF($BH11<=$BG$6,0,IF((($BH11-$BG$6)*$M$19)>=($BE11*2),$BE11*2,($BH11-$BG$6)*$M$19))","v":{"$error":"#DIV/0!"}},{"$f":"(($BE11^2)*ACOS(($BE11-$BJ11)/$BE11))-(($BE11-$BJ11)*SQRT(2*$BE11*$BJ11-($BJ11^2)))","v":{"$error":"#DIV/0!"}},{"$f":"$BK11*$BE$6","v":{"$error":"#DIV/0!"}},{"$f":"IF($BI11>=$BG$7,0,IF((($BG$7-$BI11)*$M$19)>=($BE11*2),$BE11*2,($BG$7-$BI11)*$M$19))","v":{"$error":"#DIV/0!"}},{"$f":"(($BE11^2)*ACOS(($BE11-$BM11)/$BE11))-(($BE11-$BM11)*SQRT(2*$BE11*$BM11-($BM11^2)))","v":{"$error":"#DIV/0!"}},{"$f":"$BN11*$BE$6","v":{"$error":"#DIV/0!"}}]
["Proposed","x (ft)","y (ft)",null,null,null,null,null,null,null,{"$f":"IF(OR($C$18=\"\",$C$17=\"\"),\"\",IF($C$17>=$C$18,\"ERROR - RB top elevation must be > RB toe elevation\",\"\"))","v":""},"Flow Deflection Jam",null,"Partially spanning jams consisting of one or more key members",null,null,null,"Pt 3","Stem tip: Crown",{"$f":"IF($F$25=\"\",0,IF($D$25=\"Stem tip: Crown\",$F$25,$T$11+((($E$22-$G$22)*$M$19)*$M$17)))","v":0},{"$f":"IF($G$25=\"\",$C$13,IF($D$25=\"Stem tip: Crown\",$G$25,$U$11-(($E$22-$G$22)*-$M$20)))","v":0},null,"Stem tip: Crown",{"$f":"$T$11+((($E$22-$G$22)*$M$19)*$M$17)","v":0},"OK",{"$f":"$U$11-(($E$22-$G$22)*-$M$20)","v":0},"OK",null,"WSE",{"$f":"IF($AD$8=\"\",\"\",AVERAGE(AD8:AD9))","v":0},{"$f":"IF($AE$8=\"\",\"\",AVERAGE(AE8:AE9))","v":0},null,null,"hmax,up,dry",{"$f":"IF(AND($AB$23>$F$22,$AB$24>$F$22),0,IF(AND($AB$23>=$F$22,(($F$22-$AB$24)/(COS($AI$8)))>$F$22),$F$22,IF($AB$23>=$F$22,($F$22-$AB$24)/(COS($AI$8)),IF(AND($AB$24>=$F$22,(($F$22-$AB$23)/(COS($AI$8))>$F$22)),$F$22,IF($AB$24>=$F$22,($F$22-$AB$23)/(COS($AI$8)),\"\")))))","v":0},"ft",null,null,null,null,null,null,null,null,"hmax,up,dry",{"$f":"IF(AND($Z$23>$F$22,$Z$24>$F$22),0,IF(AND($Z$23>=$F$22,(($F$22-$Z$24)/(COS($AT$8)))>$F$22),$F$22,IF($Z$23>=$F$22,($F$22-$Z$24)/(COS($AT$8)),IF(AND($Z$24>=$F$22,(($F$22-$Z$23)/(COS($AT$8))>$F$22)),$F$22,IF($Z$24>=$F$22,($F$22-$Z$23)/(COS($AT$8)),\"\")))))","v":0},"ft",null,null,null,null,null,null,null,3,0,{"$error":"#DIV/0!"},{"$error":"#DIV/0!"},{"$error":"#DIV/0!"},{"$error":"#DIV/0!"},{"$error":"#DIV/0!"},{"$error":"#DIV/0!"},{"$error":"#DIV/0!"},{"$error":"#DIV/0!"},{"$error":"#DIV/0!"},{"$error":"#DIV/0!"},{"$error":"#DIV/0!"}]
["Fldpln LB",null,null,null,null,null,null,null,null,null,{"$f":"IF(OR($B$14<$B$13,$B$15<$B$14,$B$16<$B$15,$B$17<$B$16,$B$18<$B$17,$B$19<$B$18),\"ERROR - Each 'x' distance must be >= previous point\",\"\")","v":""},"Full-Span Jam",null,"Multiple logs constricting a large portion of the cross-sectional area",null,null,null,"Pt 4","Stem tip: Bottom",{"$f":"IF($F$25=\"\",0,IF($D$25=\"Stem tip: Bottom\",$F$25,$T$12-(($F$22*-$M$20)*$M$17)))","v":0},{"$f":"IF($G$25=\"\",$C$13,IF($D$25=\"Stem tip: Bottom\",$G$25,$U$12-($F$22*$M$19)))","v":0},null,"Stem tip: Bottom",{"$f":"$T$12-(($F$22*-$M$20)*$M$17)","v":0},"OK",{"$f":"$U$12-($F$22*$M$19)","v":0},"OK",null,null,null,null,null,null,"LTS,bot,wet",{"$f":"IF(($AI$9/SIN($AI$8))>($E$22-$G$22),($E$22-$G$22-$AI$14),($AI$9/SIN($AI$8))-$AI$14)","v":{"$error":"#VALUE!"}},"ft",null,null,null,null,null,null,null,null,"LTS,bot,wet",{"$f":"IF(($AT$9/SIN($AT$8))>($E$22-$G$22),($E$22-$G$22-$AT$14),($AT$9/SIN($AT$8))-$AT$14)","v":{"$error":"#VALUE!"}},"ft",null,null,null,null,null,null,null,4,0,{"$error":"#DIV/0!"},{"$error":"#DIV/0!"},{"$error":"#DIV/0!"},{"$error":"#DIV/0!"},{"$error":"#DIV/0!"},{"$error":"#DIV/0!"},{"$error":"#DIV/0!"},{"$error":"#DIV/0!"},{"$error":"#DIV/0!"},{"$error":"#DIV/0!"},{"$error":"#DIV/0!"}]
["Top LB",null,null,null,null,null,null,null,null,null,null,"Transport Jam",null,"Wood fluvially deposited at a bar apex, meander bend, or along bank",null,null,null,"Pt 5","Root collar: Bottom",{"$f":"IF($F$25=\"\",0,IF($D$25=\"Root collar: Bottom\",$F$25,$T$13-((($E$22-$G$22)*$M$19)*$M$17)))","v":0},{"$f":"IF($G$25=\"\",$C$13,IF($D$25=\"Root collar: Bottom\",$G$25,$U$13+(($E$22-$G$22)*-$M$20)))","v":0},null,"Root collar: Bottom",{"$f":"$T$13-((($E$22-$G$22)*$M$19)*$M$17)","v":0},"OK",{"$f":"$U$13+(($E$22-$G$22)*-$M$20)","v":0},"OK",null,"Bank Labels",null,null,null,null,"LTS,top,wet",{"$f":"IF($AI$11>=$F$22,(($AI$9-($AI$11/(COS($AI$8))))/SIN($AI$8))+($AI$11*TAN($AI$8)),0)","v":{"$error":"#VALUE!"}},"ft",null,null,null,null,null,null,null,null,"LTS,top,wet",{"$f":"IF($AT$11>=$F$22,(($AT$9-($AT$11/(COS($AT$8))))/SIN($AT$8))+($AT$11*TAN($AT$8)),0)","v":{"$error":"#VALUE!"}},"ft",null,null,null,null,null,null,null,5,0,{"$error":"#DIV/0!"},{"$error":"#DIV/0!"},{"$error":"#DIV/0!"},{"$error":"#DIV/0!"},{"$error":"#DIV/0!"},{"$error":"#DIV/0!"},{"$error":"#DIV/0!"},{"$error":"#DIV/0!"},{"$error":"#DIV/0!"},{"$error":"#DIV/0!"},{"$error":"#DIV/0!"}]
["Toe LB",null,null,null,null,null,null,null,null,null,{"$f":"IF(AND($B$6=\"Rootwad\",$D$22=\"No\"),\"ERROR - Rootwad structure type should have a rootwad\",\"\")","v":""},null,null,null,null,null,null,"Pt 6","Rootwad: Bottom",{"$f":"IF($F$25=\"\",0,IF($D$25=\"Rootwad: Bottom\",$F$25,IF($D$22=\"No\",$T$14,$T$14-(($G$22*$M$19)*$M$17)-(((($H$22-$F$22)/2)*-$M$20)*$M$17))))","v":0},{"$f":"IF($G$25=\"\",$C$13,IF($D$25=\"Rootwad: Bottom\",$G$25,IF($D$22=\"No\",$U$14,$U$14+($G$22*-$M$20)-((($H$22-$F$22)/2)*$M$19))))","v":0},null,"Rootwad: Bottom",{"$f":"IF($D$22=\"No\",$T$14,$T$14-(($G$22*$M$19)*$M$17)-(((($H$22-$F$22)/2)*-$M$20)*$M$17))","v":0},"OK",{"$f":"IF($D$22=\"No\",$U$14,$U$14+($G$22*-$M$20)-((($H$22-$F$22)/2)*$M$19))","v":0},"OK",null,"LB",{"$f":"IF(OR($B$13=\"\",$B$14=\"\"),\"\",AVERAGE($B$13:$B$14))","v":""},{"$f":"IF(OR($C$13=\"\",$C$14=\"\"),\"\",AVERAGE($C$13:$C$14))","v":""},null,null,"K1",{"$f":"IF(AND(($AI$11-$AI$7)=1,$AH$17=\"Case 1\"),PI(),ACOS(1-($AI$11/$AI$7)))","v":{"$error":"#VALUE!"}},"rad",null,null,null,null,null,null,null,null,"K1",{"$f":"ACOS(1-($AT$11/$AT$7))","v":{"$error":"#VALUE!"}},"rad",null,null,null,null,null,null,null,6,0,{"$error":"#DIV/0!"},{"$error":"#DIV/0!"},{"$error":"#DIV/0!"},{"$error":"#DIV/0!"},{"$error":"#DIV/0!"},{"$error":"#DIV/0!"},{"$error":"#DIV/0!"},{"$error":"#DIV/0!"},{"$error":"#DIV/0!"},{"$error":"#DIV/0!"},{"$error":"#DIV/0!"}]
["Thalweg",null,null,null,null,null,null,null,null,null,{"$f":"IF(OR($N$52=\"\",$F$25=\"\",$G$25=\"\"),\"\",IF(AND($B$6=\"Rootwad\",$N$52<>\"Exposed in stream\"),\"CHECK - Rootwad structure typically has exposed rootwad\",\"\"))","v":""},null,null,null,null,null,null,null,null,null,null,null,null,null,null,null,null,null,"RB",{"$f":"IF(OR($B$18=\"\",$B$19=\"\"),\"\",AVERAGE($B$18:$B$19))","v":""},{"$f":"IF(OR($C$18=\"\",$C$19=\"\"),\"\",AVERAGE($C$18:$C$19))","v":""},null,null,"K2",{"$f":"IF($AI$12=\"\",\"\",ACOS(1-($AI$12/$AI$7)))","v":{"$error":"#DIV/0!"}},"rad",null,null,null,null,null,null,null,null,"K2",{"$f":"IF($AT$12=\"\",\"\",ACOS(1-($AT$12/$AT$7)))","v":{"$error":"#DIV/0!"}},"rad",null,null,null,null,null,null,null,7,0,{"$error":"#DIV/0!"},{"$error":"#DIV/0!"},{"$error":"#DIV/0!"},{"$error":"#DIV/0!"},{"$error":"#DIV/0!"},{"$error":"#DIV/0!"},{"$error":"#DIV/0!"},{"$error":"#DIV/0!"},{"$error":"#DIV/0!"},{"$error":"#DIV/0!"},{"$error":"#DIV/0!"}]
["Toe RB",null,null,null,null,null,null,null,null,null,null,"cos (q+90) =",{"$f":"IF($B$25=\"\",0,COS(($B$25+90)*PI()/180))","v":0},null,null,null,null,null,"Rootwad Coordinates",null,null,null,null,null,null,null,null,null,null,null,null,null,"check:",{"$f":"IF(AND($AA$21=\"Wet\",$AA$22=\"Wet\",$AA$23=\"Wet\",$AA$24=\"Wet\"),\"Log is completely submerged\",IF(AND($AA$21=\"Dry\",$AA$22=\"Dry\",OR(AND($AA$23=\"Dry\",$AA$24=\"Wet\"),AND($AA$24=\"Dry\",$AA$23=\"Wet\"))),\"Case 1\",IF(OR(AND($AA$21=\"Wet\",$AA$24=\"Wet\",$AA$22=\"Dry\",$AA$23=\"Dry\"),AND($AA$22=\"Wet\",$AA$23=\"Wet\",$AA$21=\"Dry\",$AA$24=\"Dry\")),\"Case 2\",IF(AND($AA$22=\"Dry\",$AA$23=\"Wet\",$AA$21=\"Dry\",$AA$24=\"Wet\"),\"Case 3\",IF(OR(AND($AA$21=\"Dry\",$AA$22=\"Wet\",$AA$23=\"Wet\",$AA$24=\"Wet\"),AND($AA$21=\"Wet\",$AA$22=\"Dry\",$AA$23=\"Wet\",$AA$24=\"Wet\")),\"Case 4\",\"Stem is Dry\")))))","v":"Stem is Dry"},null,null,"VTS =",{"$f":"PI()*(($F$22/2)^2)*($E$22-$G$22)","v":0},"ft3",null,null,null,null,"check:",{"$f":"IF(AND($Y$21=\"Wet\",$Y$22=\"Wet\",$Y$23=\"Wet\",$Y$24=\"Wet\"),\"Log is completely submerged\",IF(AND($Y$21=\"Dry\",$Y$22=\"Dry\",OR(AND($Y$23=\"Dry\",$Y$24=\"Wet\"),AND($Y$24=\"Dry\",$Y$23=\"Wet\"))),\"Case 1\",IF(OR(AND($Y$21=\"Wet\",$Y$24=\"Wet\",$Y$22=\"Dry\",$Y$23=\"Dry\"),AND($Y$22=\"Wet\",$Y$23=\"Wet\",$Y$21=\"Dry\",$Y$24=\"Dry\")),\"Case 2\",IF(AND($Y$22=\"Dry\",$Y$23=\"Wet\",$Y$21=\"Dry\",$Y$24=\"Wet\"),\"Case 3\",IF(OR(AND($Y$21=\"Dry\",$Y$22=\"Wet\",$Y$23=\"Wet\",$Y$24=\"Wet\"),AND($Y$21=\"Wet\",$Y$22=\"Dry\",$Y$23=\"Wet\",$Y$24=\"Wet\")),\"Case 4\",\"Stem is Dry\")))))","v":"Stem is Dry"},null,null,"VTS =",{"$f":"PI()*(($F$22/2)^2)*($E$22-$G$22)","v":0},"ft3",null,null,null,null,8,0,{"$error":"#DIV/0!"},{"$error":"#DIV/0!"},{"$error":"#DIV/0!"},{"$error":"#DIV/0!"},{"$error":"#DIV/0!"},{"$error":"#DIV/0!"},{"$error":"#DIV/0!"},{"$error":"#DIV/0!"},{"$error":"#DIV/0!"},{"$error":"#DIV/0!"},{"$error":"#DIV/0!"}]
["Top RB",null,null,null,null,null,null,null,null,null,null,"sin (q+90) =",{"$f":"IF($B$25=\"\",0,SIN(($B$25+90)*PI()/180))","v":0},null,null,null,null,null,null,"x (ft)","y (ft)",null,"Large Wood \"Below Thalweg\" and \"Below Water Surface\" Depths",null,null,null,null,null,null,null,null,null,"Case 1",null,null,null,null,null,null,null,null,null,null,"Case 1",null,null,null,null,null,null,null,null,null,null,9,0,{"$error":"#DIV/0!"},{"$error":"#DIV/0!"},{"$error":"#DIV/0!"},{"$error":"#DIV/0!"},{"$error":"#DIV/0!"},{"$error":"#DIV/0!"},{"$error":"#DIV/0!"},{"$error":"#DIV/0!"},{"$error":"#DIV/0!"},{"$error":"#DIV/0!"},{"$error":"#DIV/0!"}]
["Fldpln RB",null,null,null,null,null,null,null,null,null,{"$f":"IF($C$25=\"\",\"\",IF(OR($C$25>=90,$C$25<=-90),\"ERROR - Angle of tilt must be between (-)89.9 and (+)89.9 deg\",\"\"))","v":""},"cos b =",{"$f":"IF($C$25=\"\",0,COS($C$25*PI()/180))","v":0},null,null,null,null,null,"RW bottom1",{"$f":"IF($T$15=\"\",\"\",$T$15)","v":0},{"$f":"IF($U$15=\"\",$C$13,$U$15)","v":0},null,null,"Point","↓twCondition","dT,wet","↓WSECondition","dT↓dw",null,null,null,null,null,null,"V =","LTS,bot,wet/hmax,lower*R3*(sin K1 – K1*cos K1 – 1/3*(sin K1)3)",null,null,null,null,null,null,null,null,null,"V =","LTS,bot,wet/hmax,lower*R3*(sin K1 – K1*cos K1 – 1/3*(sin K1)3)",null,null,null,null,null,null,null,10,0,{"$error":"#DIV/0!"},{"$error":"#DIV/0!"},{"$error":"#DIV/0!"},{"$error":"#DIV/0!"},{"$error":"#DIV/0!"},{"$error":"#DIV/0!"},{"$error":"#DIV/0!"},{"$error":"#DIV/0!"},{"$error":"#DIV/0!"},{"$error":"#DIV/0!"},{"$error":"#DIV/0!"}]
[null,null,null,null,null,null,null,null,null,null,{"$f":"IF(OR($B$25=\"\",$A$6=\"\"),\"\",IF(OR($B$25>360,$B$25<-180),\"ERROR - Orientation angle must be (-)180 to (+)360 deg\",\"\"))","v":""},"sin b =",{"$f":"IF($C$25=\"\",0,SIN($C$25*PI()/180))","v":0},null,null,null,null,null,"RW sid1",{"$f":"IF($T$19=\"\",\"\",IF($D$22=\"No\",$T$19+((SIN(45*PI()/180))*$M$18),(($T$19+$T$21)/2)+((SIN(45*PI()/180))*$M$18)))","v":0},{"$f":"IF($U$15=\"\",$C$13,($U$21+$U$19)/2)","v":0},null,"Rootwad: Crown","Pt 1",{"$f":"IF($U10<$C$16,\"Wet\",\"Dry\")","v":"Dry"},{"$f":"IF($C$16<U10,0,$C$16-U10)","v":0},{"$f":"IF($U10<$AE$8,\"Wet\",\"Dry\")","v":"Dry"},{"$f":"IF(U10>$AE$8,0,$AE$8-U10)","v":0},null,null,null,null,null,null,"where:","K1 = arccos(1-hmax,lower/R)",null,null,null,null,null,null,null,null,null,"where:","K1 = arccos(1-hmax,lower/R)",null,null,null,null,null,null,null,11,0,{"$error":"#DIV/0!"},{"$error":"#DIV/0!"},{"$error":"#DIV/0!"},{"$error":"#DIV/0!"},{"$error":"#DIV/0!"},{"$error":"#DIV/0!"},{"$error":"#DIV/0!"},{"$error":"#DIV/0!"},{"$error":"#DIV/0!"},{"$error":"#DIV/0!"},{"$error":"#DIV/0!"}]
["Wood Species",null,null,"Rootwad","LT (ft)","DTS (ft)","LRW (ft)","DRW (ft)","gTd (lb/ft3)","gTgr (lb/ft3)",{"$f":"IF(AND($D$22=\"No\",OR($D$25=\"Rootwad: Crown\",$D$25=\"Rootwad: Bottom\")),\"ERROR - No rootwad, define a different starting point\",\"\")","v":""},"typ RW b =",{"$f":"IF($E$22=\"\",0,ROUND((-ATAN(((($H$22-$F$22)/2))/$E$22)*180/PI()),1))","v":0},null,null,null,null,null,"RW sid2",{"$f":"IF($T$19=\"\",\"\",IF($D$22=\"No\",(($T$19+$T$23)/2)+($F$22/2*$M$18),(($T$19+$T$23)/2)+($H$22/2*$M$18)))","v":0},{"$f":"IF($U$15=\"\",$C$13,($U$19+$U$23)/2)","v":0},null,"Root collar: Crown","Pt 2","Dry",0,"Dry",0,null,null,null,null,null,null,"VTS,wet,C1",{"$f":"($AI$13/$AI$11)*($AI$7^3)*(SIN($AI$15)-($AI$15*COS($AI$15))-((1/3)*(SIN($AI$15))^3))","v":{"$error":"#VALUE!"}},"ft3",null,null,null,null,null,null,null,null,"VTS,wet,C1",{"$f":"($AT$13/$AT$11)*($AT$7^3)*(SIN($AT$15)-($AT$15*COS($AT$15))-((1/3)*(SIN($AT$15))^3))","v":{"$error":"#VALUE!"}},"ft3",null,null,null,null,null,null,12,0,{"$error":"#DIV/0!"},{"$error":"#DIV/0!"},{"$error":"#DIV/0!"},{"$error":"#DIV/0!"},{"$error":"#DIV/0!"},{"$error":"#DIV/0!"},{"$error":"#DIV/0!"},{"$error":"#DIV/0!"},{"$error":"#DIV/0!"},{"$error":"#DIV/0!"},{"$error":"#DIV/0!"}]
[null,null,null,null,null,null,{"$f":"IF(OR($D$22=\"No\",$D$22=\"\"),0,IF($F$22=\"\",0,$F$22*LFRW))","v":0},{"$f":"IF(OR($D$22=\"No\",$D$22=\"\"),0,IF($F$22=\"\",0,$F$22*DFRW))","v":0},{"$f":"IF($A$22=\"\",\"\",VLOOKUP($A$22,'5-Wood'!$B$8:$E$17,3,0))","v":""},{"$f":"IF($A$22=\"\",\"\",VLOOKUP($A$22,'5-Wood'!$B$8:$E$17,4,0))","v":""},null,null,null,null,null,null,null,null,"RW sid3",{"$f":"IF($T$19=\"\",\"\",IF($D$22=\"No\",$T$23+((SIN(45*PI()/180))*$M$18),(($T$23+$T$21)/2)+((SIN(45*PI()/180))*$M$18)))","v":0},{"$f":"IF($U$15=\"\",$C$13,($U$21+$U$23)/2)","v":0},null,"Stem tip: Crown","Pt 3","Dry",0,"Dry",0,null,null,null,null,null,null,null,null,null,null,null,null,null,null,null,null,null,null,null,null,null,null,null,null,null,null,13,0,{"$error":"#DIV/0!"},{"$error":"#DIV/0!"},{"$error":"#DIV/0!"},{"$error":"#DIV/0!"},{"$error":"#DIV/0!"},{"$error":"#DIV/0!"},{"$error":"#DIV/0!"},{"$error":"#DIV/0!"},{"$error":"#DIV/0!"},{"$error":"#DIV/0!"},{"$error":"#DIV/0!"}]
[null,null,null,null,null,null,null,null,null,null,null,null,null,null,null,null,null,null,"RW crown",{"$f":"IF($T$19=\"\",\"\",$T$10)","v":0},{"$f":"IF($U$15=\"\",$C$13,$U$10)","v":0},null,"Stem tip: Bottom","Pt 4","Dry",0,"Dry",0,null,null,null,null,"Case 2",null,null,null,null,null,null,null,null,null,null,"Case 2",null,null,null,null,null,null,null,null,null,null,14,0,{"$error":"#DIV/0!"},{"$error":"#DIV/0!"},{"$error":"#DIV/0!"},{"$error":"#DIV/0!"},{"$error":"#DIV/0!"},{"$error":"#DIV/0!"},{"$error":"#DIV/0!"},{"$error":"#DIV/0!"},{"$error":"#DIV/0!"},{"$error":"#DIV/0!"},{"$error":"#DIV/0!"}]
["Structure Geometry","q (deg)","b (deg)","Define Fixed Point",null,"xT (ft)","yT (ft)","yT,min (ft)","yT,max (ft)","ATp (ft2)",null,null,null,null,null,null,null,null,"RW sid4",{"$f":"IF($T$19=\"\",\"\",IF($D$22=\"No\",$T$23-((SIN(45*PI()/180))*$M$18),(($T$23+$T$25)/2)-((SIN(45*PI()/180))*$M$18)))","v":0},{"$f":"IF($U$15=\"\",$C$13,($U$25+$U$23)/2)","v":0},null,"Root collar: Bottom","Pt 5","Dry",0,"Dry",0,null,null,null,null,null,null,"V =","(p*R2*LTS,top,wet) + (LTS,bot,wet/hmax,lower*R3*(sin K1 – K1*cos K1 – 1/3*(sin K1)3)",null,null,null,null,null,null,null,null,null,"V =","(p*R2*LTS,top,wet) + (LTS,bot,wet/hmax,lower*R3*(sin K1 – K1*cos K1 – 1/3*(sin K1)3)",null,null,null,null,null,null,null,15,0,{"$error":"#DIV/0!"},{"$error":"#DIV/0!"},{"$error":"#DIV/0!"},{"$error":"#DIV/0!"},{"$error":"#DIV/0!"},{"$error":"#DIV/0!"},{"$error":"#DIV/0!"},{"$error":"#DIV/0!"},{"$error":"#DIV/0!"},{"$error":"#DIV/0!"},{"$error":"#DIV/0!"}]
[null,null,null,null,null,null,null,{"$f":"IF(OR($E$22=\"\",$F$22=\"\",$F$25=\"\",$G$25=\"\"),\"\",MIN($U$10:$U$15))","v":""},{"$f":"IF(OR($E$22=\"\",$F$22=\"\",$F$25=\"\",$G$25=\"\"),\"\",MAX($U$10:$U$15))","v":""},{"$f":"IF(OR($E$22=\"\",$F$22=\"\",$F$25=\"\",$G$25=\"\"),\"\",IF($T$81<0,$AB$80,IF($T$81>$T$77,$T$77+$AB$80,IF(OR(AND($C$25=0,$D$22=\"No\",$B$25=0),AND($C$25=0,$D$22=\"No\",$B$25=360),AND($C$25=0,$D$22=\"No\",$B$25=180)),PI()*(($F$22/2)^2),$T$81+$AB$80))))","v":""},{"$f":"IF(OR($B$13=\"\",$B$19=\"\",$U$38=0,$U$39=0),\"\",IF(OR(MAX($U$38:$U$39)>$B$19,MIN($U$38:$U$39)<$B$13),\"ERROR - Log extends beyond limits of floodplain\",\"\"))","v":""},null,null,null,null,null,null,null,"RW sid5",{"$f":"IF($T$19=\"\",\"\",IF($D$22=\"No\",(($T$27+$T$23)/2)-($F$22/2*$M$18),(($T$27+$T$23)/2)-($H$22/2*$M$18)))","v":0},{"$f":"IF($U$15=\"\",$C$13,($U$27+$U$23)/2)","v":0},null,"Rootwad: Bottom","Pt 6","Dry",0,"Dry",0,null,null,null,null,null,null,"where:","K1 = arccos(1-hmax,lower/R)",null,null,null,null,null,null,null,null,null,"where:","K1 = arccos(1-hmax,lower/R)",null,null,null,null,null,null,null,16,0,{"$error":"#DIV/0!"},{"$error":"#DIV/0!"},{"$error":"#DIV/0!"},{"$error":"#DIV/0!"},{"$error":"#DIV/0!"},{"$error":"#DIV/0!"},{"$error":"#DIV/0!"},{"$error":"#DIV/0!"},{"$error":"#DIV/0!"},{"$error":"#DIV/0!"},{"$error":"#DIV/0!"}]
[null,null,null,null,null,null,null,null,null,null,null,null,null,null,null,null,null,null,"RW sid6",{"$f":"IF($T$19=\"\",\"\",IF($D$22=\"No\",$T$27-((SIN(45*PI()/180))*$M$18),(($T$27+$T$25)/2)-((SIN(45*PI()/180))*$M$18)))","v":0},{"$f":"IF($U$15=\"\",$C$13,($U$25+$U$27)/2)","v":0},null,null,null,null,null,null,null,null,null,null,null,null,null,"VTS,wet,C2",{"$f":"(PI()*(($AI$7)^2)*($AI$14))+($AI$13/$AI$11)*($AI$7^3)*(SIN($AI$15)-($AI$15*COS($AI$15))-((1/3)*(SIN($AI$15))^3))","v":{"$error":"#VALUE!"}},"ft3",null,null,null,null,null,null,null,null,"VTS,wet,C2",{"$f":"(PI()*(($AT$7)^2)*($AT$14))+($AT$13/$AT$11)*($AT$7^3)*(SIN($AT$15)-($AT$15*COS($AT$15))-((1/3)*(SIN($AT$15))^3))","v":{"$error":"#VALUE!"}},"ft3",null,null,null,null,null,null,17,0,{"$error":"#DIV/0!"},{"$error":"#DIV/0!"},{"$error":"#DIV/0!"},{"$error":"#DIV/0!"},{"$error":"#DIV/0!"},{"$error":"#DIV/0!"},{"$error":"#DIV/0!"},{"$error":"#DIV/0!"},{"$error":"#DIV/0!"},{"$error":"#DIV/0!"},{"$error":"#DIV/0!"}]
["Soils","Material",null,"gs (lb/ft3)","g's (lb/ft3)","f (deg)","Soil Class","LT,em (ft)","db,max (ft)","db,avg (ft)",null,null,null,null,null,null,null,null,"RW bottom2",{"$f":"IF($T$19=\"\",\"\",$T$15)","v":0},{"$f":"IF($U$15=\"\",$C$13,$U$15)","v":0},null,null,null,null,null,null,null,null,null,null,null,null,null,null,null,null,null,null,null,null,null,null,null,null,null,null,null,null,null,null,null,null,null,18,0,{"$error":"#DIV/0!"},{"$error":"#DIV/0!"},{"$error":"#DIV/0!"},{"$error":"#DIV/0!"},{"$error":"#DIV/0!"},{"$error":"#DIV/0!"},{"$error":"#DIV/0!"},{"$error":"#DIV/0!"},{"$error":"#DIV/0!"},{"$error":"#DIV/0!"},{"$error":"#DIV/0!"}]
["Stream Bed",{"$f":"IF($A$6=\"\",\"\",VLOOKUP($A$6,Soil,4,0))","v":""},null,{"$f":"IF($A$6=\"\",\"\",VLOOKUP($A$6,Soil,6,0))","v":""},{"$f":"IF($A$6=\"\",\"\",VLOOKUP($A$6,Soil,7,0))","v":""},{"$f":"IF($A$6=\"\",\"\",VLOOKUP($A$6,Soil,8,0))","v":""},{"$f":"IF($A$6=\"\",\"\",VLOOKUP($A$6,Soil,5,0))","v":""},{"$f":"IF(OR($E$22=\"\",$F$22=\"\",$F$25=\"\",$G$25=\"\"),\"\",IF(AND($F$25<=$B$17,$F$25>=$B$15,OR($B$25=0,$B$25=180,$B$25=360)),SUM($X$49:$X$50),$AB$49+$AB$50))","v":""},{"$f":"IF(OR($E$22=\"\",$F$22=\"\",$F$25=\"\",$G$25=\"\"),\"\",$AT$42)","v":""},{"$f":"IF(OR($E$22=\"\",$F$22=\"\",$F$25=\"\",$G$25=\"\"),\"\",$AT$41)","v":""},null,null,null,null,null,null,null,null,null,null,null,null,null,null,null,null,null,null,null,null,null,null,"Case 3",null,null,null,null,null,null,null,null,null,null,"Case 3",null,null,null,null,null,null,null,null,null,null,19,0,{"$error":"#DIV/0!"},{"$error":"#DIV/0!"},{"$error":"#DIV/0!"},{"$error":"#DIV/0!"},{"$error":"#DIV/0!"},{"$error":"#DIV/0!"},{"$error":"#DIV/0!"},{"$error":"#DIV/0!"},{"$error":"#DIV/0!"},{"$error":"#DIV/0!"},{"$error":"#DIV/0!"}]
["Bank",{"$f":"IF($A$6=\"\",\"\",VLOOKUP($A$6,Soil,9,0))","v":""},null,{"$f":"IF($A$6=\"\",\"\",VLOOKUP($A$6,Soil,11,0))","v":""},{"$f":"IF($A$6=\"\",\"\",VLOOKUP($A$6,Soil,12,0))","v":""},{"$f":"IF($A$6=\"\",\"\",VLOOKUP($A$6,Soil,13,0))","v":""},{"$f":"IF($A$6=\"\",\"\",VLOOKUP($A$6,Soil,10,0))","v":""},{"$f":"IF(OR($E$22=\"\",$F$22=\"\",$F$25=\"\",$G$25=\"\"),\"\",IF(AND(OR($F$25>$B$17,$F$25<$B$15),OR($B$25=0,$B$25=180,$B$25=360)),SUM($X$47+$X$48+$X$51+$X$52),$AB$47+$AB$48+$AB$51+$AB$52))","v":""},{"$f":"IF(OR($E$22=\"\",$F$22=\"\",$F$25=\"\",$G$25=\"\"),\"\",$AU$42)","v":""},{"$f":"IF(OR($E$22=\"\",$F$22=\"\",$F$25=\"\",$G$25=\"\"),\"\",$AU$41)","v":""},{"$f":"IF(OR($E$22=\"\",$F$22=\"\",$F$25=\"\",$G$25=\"\"),\"\",IF(($H$28+$H$29)>$E$22,\"ERROR - Embedded length of log exceeds total length of log\",\"\"))","v":""},null,null,null,null,null,null,null,"Coordinates of Large Wood Crown at Key Points",null,null,null,null,null,null,null,null,null,null,null,null,null,null,null,"V =","LTS*(R2*arccos((R-dwet,avgH)/R)-(R-dwet,avgH)*((2*R*dwet,avgH)-dwet,avgH2)0.5)",null,null,null,null,null,null,null,null,null,"V =","LTS*(R2*arccos((R-dwet,avgH)/R)-(R-dwet,avgH)*((2*R*dwet,avgH)-dwet,avgH2)0.5)",null,null,null,null,null,null,null,20,0,{"$error":"#DIV/0!"},{"$error":"#DIV/0!"},{"$error":"#DIV/0!"},{"$error":"#DIV/0!"},{"$error":"#DIV/0!"},{"$error":"#DIV/0!"},{"$error":"#DIV/0!"},{"$error":"#DIV/0!"},{"$error":"#DIV/0!"},{"$error":"#DIV/0!"},{"$error":"#DIV/0!"}]
[null,null,null,null,null,null,null,null,null,null,null,null,null,null,null,null,null,null,null,"Wood Present?","Large Wood Parameters",null,null,null,"Soil",null,"Slope","Bank (ft/ft)",null,null,null,null,null,null,"VTS,wet,C3",{"$f":"IF($AI$10=\"\",\"\",($E$22-$G$22)*((($AI$7^2)*ACOS(($AI$7-$AI$10)/$AI$7))-(($AI$7-$AI$10)*((2*$AI$7*$AI$10)-($AI$10^2))^0.5)))","v":""},"ft3",null,null,null,null,null,null,null,null,"VTS,wet,C3",{"$f":"IF($AT$10=\"\",\"\",($E$22-$G$22)*((($AT$7^2)*ACOS(($AT$7-$AT$10)/$AT$7))-(($AT$7-$AT$10)*((2*$AT$7*$AT$10)-($AT$10^2))^0.5)))","v":""},"ft3",null,null,null,null,null,null,21,0,{"$error":"#DIV/0!"},{"$error":"#DIV/0!"},{"$error":"#DIV/0!"},{"$error":"#DIV/0!"},{"$error":"#DIV/0!"},{"$error":"#DIV/0!"},{"$f":"(($BE30^2)*ACOS(($BE30-$BJ30)/$BE30))-(($BE30-$BJ30)*SQRT(2*$BE30*$BJ30-($BJ30^2)))","v":{"$error":"#DIV/0!"}},{"$f":"$BK30*$BE$6","v":{"$error":"#DIV/0!"}},{"$error":"#DIV/0!"},{"$error":"#DIV/0!"},{"$error":"#DIV/0!"}]
[null,null,null,null,null,null,null,null,null,null,null,null,null,null,null,null,null,null,null,null,"xTS (ft)","Dist (ft)","Adjusted Dist (ft)","yTS (ft)","ysoil (ft)",null,"Fldpln LB",{"$f":"IF(OR($B$13=\"\",$B$14=\"\",$C$13=\"\",$C$14=\"\"),\"\",($C$14-$C$13)/($B$14-$B$13))","v":""},null,null,null,null,null,null,null,null,null,null,null,null,null,null,null,null,null,null,null,null,null,null,null,null,null,null,22,0,{"$error":"#DIV/0!"},{"$error":"#DIV/0!"},{"$error":"#DIV/0!"},{"$error":"#DIV/0!"},{"$error":"#DIV/0!"},{"$error":"#DIV/0!"},{"$error":"#DIV/0!"},{"$error":"#DIV/0!"},{"$error":"#DIV/0!"},{"$error":"#DIV/0!"},{"$error":"#DIV/0!"}]
[null,null,null,null,null,null,null,null,null,null,null,null,null,null,null,null,null,null,"At Left Bank Top",{"$f":"IF(OR($F$25=\"\",$G$25=\"\"),\"No\",IF(MIN($U$38:$U$39)>$B$14,\"No\",IF(MAX($U$38:$U$39)<$B$14,\"No\",\"Yes\")))","v":"No"},{"$f":"$B$14","v":0},{"$f":"IF(OR($B$25=0,$B$25=180,$B$25=360),0,IF($T$11>$T$12,$G$22+((($T$11-$B$14)/ABS($M$17))/$M$19),(($T$12-$B$14)/ABS($M$17))/$M$19))","v":0},{"$f":"IF(V32<0,0,IF(V32>$E$22,$E$22,V32))","v":0},{"$f":"IF($T$11>$T$12,$U$11+(($V$32-$G$22)*$M$20),$U$12-($V$32*$M$20))","v":0},{"$f":"$C$14","v":0},null,"LB",{"$f":"IF(OR($B$14=\"\",$B$15=\"\",$C$14=\"\",$C$15=\"\"),\"\",($C$15-$C$14)/($B$15-$B$14))","v":""},null,null,null,null,null,null,null,null,null,null,null,null,null,null,null,null,null,null,null,null,null,null,null,null,null,null,23,0,{"$error":"#DIV/0!"},{"$error":"#DIV/0!"},{"$error":"#DIV/0!"},{"$error":"#DIV/0!"},{"$error":"#DIV/0!"},{"$error":"#DIV/0!"},{"$error":"#DIV/0!"},{"$error":"#DIV/0!"},{"$error":"#DIV/0!"},{"$error":"#DIV/0!"},{"$error":"#DIV/0!"}]
[null,null,null,null,null,null,null,null,null,null,null,null,null,null,null,null,null,null,"At Left Bank Toe",{"$f":"IF(OR($F$25=\"\",$G$25=\"\"),\"No\",IF(MIN($U$38:$U$39)>$B$15,\"No\",IF(MAX($U$38:$U$39)<$B$15,\"No\",\"Yes\")))","v":"No"},{"$f":"$B$15","v":0},{"$f":"IF(OR($B$25=0,$B$25=180,$B$25=360),0,IF($T$11>$T$12,$G$22+((($T$11-$B$15)/ABS($M$17))/$M$19),(($T$12-$B$15)/ABS($M$17))/$M$19))","v":0},0,{"$f":"IF($T$11>$T$12,$U$11+(($V$33-$G$22)*$M$20),$U$12-($V$33*$M$20))","v":0},{"$f":"$C$15","v":0},null,"Stream L",{"$f":"IF(OR($B$15=\"\",$B$16=\"\",$C$15=\"\",$C$16=\"\"),\"\",($C$16-$C$15)/($B$16-$B$15))","v":""},null,null,null,null,null,null,null,null,null,null,null,null,null,null,null,null,null,null,null,null,null,null,null,null,null,null,24,0,{"$error":"#DIV/0!"},{"$error":"#DIV/0!"},{"$error":"#DIV/0!"},{"$error":"#DIV/0!"},{"$error":"#DIV/0!"},{"$error":"#DIV/0!"},{"$error":"#DIV/0!"},{"$error":"#DIV/0!"},{"$error":"#DIV/0!"},{"$error":"#DIV/0!"},{"$error":"#DIV/0!"}]
[null,null,null,null,null,null,null,null,null,null,null,null,null,null,null,null,null,null,"At Left Thalweg",{"$f":"IF(OR($F$25=\"\",$G$25=\"\"),\"No\",IF(AND(MAX($U$38:$U$39)>$B$16,MIN($U$38:$U$39)<$B$16),\"Yes\",\"No\"))","v":"No"},{"$f":"$B$16","v":0},{"$f":"IF(OR($B$25=0,$B$25=180,$B$25=360),0,IF($T$11>$T$12,$G$22+((($T$11-$B$16)/ABS($M$17))/$M$19),(($T$12-$B$16)/ABS($M$17))/$M$19))","v":0},0,{"$f":"IF($T$11>$T$12,$U$11+(($V$34-$G$22)*$M$20),$U$12-($V$34*$M$20))","v":0},{"$f":"$C$16","v":0},null,"Stream R",{"$f":"IF(OR($B$17=\"\",$B$16=\"\",$C$17=\"\",$C$16=\"\"),\"\",($C$16-$C$17)/($B$16-$B$17))","v":""},null,null,null,null,"Case 4",null,null,null,null,null,null,null,null,null,null,"Case 4",null,null,null,null,null,null,null,null,null,null,25,0,{"$error":"#DIV/0!"},{"$error":"#DIV/0!"},{"$error":"#DIV/0!"},{"$error":"#DIV/0!"},{"$error":"#DIV/0!"},{"$error":"#DIV/0!"},{"$error":"#DIV/0!"},{"$error":"#DIV/0!"},{"$error":"#DIV/0!"},{"$error":"#DIV/0!"},{"$error":"#DIV/0!"}]
[null,null,null,null,null,null,null,null,null,null,null,null,null,null,null,null,null,null,"At Right Thalweg",{"$f":"IF(OR($F$25=\"\",$G$25=\"\"),\"No\",IF(AND(MAX($U$38:$U$39)>$B$16,MIN($U$38:$U$39)<$B$16),\"Yes\",\"No\"))","v":"No"},{"$f":"$B$16","v":0},{"$f":"IF(OR($B$25=0,$B$25=180,$B$25=360),0,IF($T$11<$T$12,$G$22+((($B$16-$T$11)/ABS($M$17))/$M$19),(($B$16-$T$12)/ABS($M$17))/$M$19))","v":0},0,{"$f":"IF($T$11<$T$12,$U$11+(($V$35-$G$22)*$M$20),$U$12-($V$35*$M$20))","v":0},{"$f":"$C$16","v":0},null,"RB",{"$f":"IF(OR($B$18=\"\",$B$17=\"\",$C$18=\"\",$C$17=\"\"),\"\",($C$18-$C$17)/($B$18-$B$17))","v":""},null,null,null,null,null,null,"V =","VTS - (LTS,wet/hmax,up,dry*R3*(sin K2 – K2*cos K2 – 1/3*(sin K2)3)",null,null,null,null,null,null,null,null,null,"V =","VTS - (LTS,wet/hmax,up,dry*R3*(sin K2 – K2*cos K2 – 1/3*(sin K2)3)",null,null,null,null,null,null,null,26,0,{"$error":"#DIV/0!"},{"$error":"#DIV/0!"},{"$error":"#DIV/0!"},{"$error":"#DIV/0!"},{"$error":"#DIV/0!"},{"$error":"#DIV/0!"},{"$error":"#DIV/0!"},{"$error":"#DIV/0!"},{"$error":"#DIV/0!"},{"$error":"#DIV/0!"},{"$error":"#DIV/0!"}]
[null,null,null,null,null,null,null,null,null,null,null,null,null,null,null,null,null,null,"At Right Bank Toe",{"$f":"IF(OR($F$25=\"\",$G$25=\"\"),\"No\",IF(MAX($U$38:$U$39)<$B$17,\"No\",IF(MIN($U$38:$U$39)>$B$17,\"No\",\"Yes\")))","v":"No"},{"$f":"$B$17","v":0},{"$f":"IF(OR($B$25=0,$B$25=180,$B$25=360),0,IF($T$11<$T$12,$G$22+((($B$17-$T$11)/ABS($M$17))/$M$19),(($B$17-$T$12)/ABS($M$17))/$M$19))","v":0},0,{"$f":"IF($T$11<$T$12,$U$11+(($V$36-$G$22)*$M$20),$U$12-($V$36*$M$20))","v":0},{"$f":"$C$17","v":0},null,"Fldpln RB",{"$f":"IF(OR($B$19=\"\",$B$18=\"\",$C$19=\"\",$C$18=\"\"),\"\",($C$19-$C$18)/($B$19-$B$18))","v":""},null,null,null,null,null,null,null,"K2 = arccos(1-hmax,up,dry/R)",null,null,null,null,null,null,null,null,null,null,"K2 = arccos(1-hmax,up,dry/R)",null,null,null,null,null,null,null,27,0,{"$error":"#DIV/0!"},{"$error":"#DIV/0!"},{"$error":"#DIV/0!"},{"$error":"#DIV/0!"},{"$error":"#DIV/0!"},{"$error":"#DIV/0!"},{"$error":"#DIV/0!"},{"$error":"#DIV/0!"},{"$error":"#DIV/0!"},{"$error":"#DIV/0!"},{"$error":"#DIV/0!"}]
[null,null,null,null,null,null,null,null,null,null,null,null,null,null,null,null,null,null,"At Right Bank Top",{"$f":"IF(OR($F$25=\"\",$G$25=\"\"),\"No\",IF(MAX($U$38:$U$39)<$B$18,\"No\",IF(MIN($U$38:$U$39)>$B$18,\"No\",\"Yes\")))","v":"No"},{"$f":"$B$18","v":0},{"$f":"IF(OR($B$25=0,$B$25=180,$B$25=360),0,IF($T$11<$T$12,$G$22+((($B$18-$T$11)/ABS($M$17))/$M$19),(($B$18-$T$12)/ABS($M$17))/$M$19))","v":0},0,{"$f":"IF($T$11<$T$12,$U$11+(($V$37-$G$22)*$M$20),$U$12-($V$37*$M$20))","v":0},{"$f":"$C$18","v":0},null,null,null,null,null,null,null,null,null,"VTS,wet,C4",{"$f":"IF($AI$16=\"\",\"\",$AW$17-(($AI$13/$AI$12)*($AI$7^3)*(SIN($AI$16)-($AI$16*COS($AI$16))-((1/3)*(SIN($AI$16))^3))))","v":{"$error":"#DIV/0!"}},"ft3",null,null,null,null,null,null,null,null,"VTS,wet,C4",{"$f":"IF($AT$16=\"\",\"\",$AW$17-(($AT$13/$AT$12)*($AT$7^3)*(SIN($AT$16)-($AT$16*COS($AT$16))-((1/3)*(SIN($AT$16))^3))))","v":{"$error":"#DIV/0!"}},"ft3",null,null,null,null,null,null,28,0,{"$error":"#DIV/0!"},{"$error":"#DIV/0!"},{"$error":"#DIV/0!"},{"$error":"#DIV/0!"},{"$error":"#DIV/0!"},{"$error":"#DIV/0!"},{"$error":"#DIV/0!"},{"$error":"#DIV/0!"},{"$error":"#DIV/0!"},{"$error":"#DIV/0!"},{"$error":"#DIV/0!"}]
[null,null,null,null,null,null,null,null,null,null,null,null,null,null,null,null,null,null,"Low Pt on Crown",{"$f":"IF(OR($F$25=\"\",$G$25=\"\"),\"No\",\"Yes\")","v":"No"},{"$f":"IF($T$38=\"No\",0,IF($U$12<=$U$11,$T$12,$T$11-($G$22*$M$19*$M$17)))","v":0},0,0,{"$f":"IF($T$38=\"No\",0,IF($U$12<=$U$11,$U$12,$U$11-($G$22*$M$20)))","v":0},{"$f":"IF($T$38=\"\",\"\",IF($U$38<$B$14,(($U$38-$B$13)*$AB$31)+$C$13,IF($U$38<$B$15,(($U$38-$B$14)*$AB$32)+$C$14,IF($U$38<$B$16,(($U$38-$B$15)*$AB$33)+$C$15,IF($U$38<$B$17,(($U$38-$B$16)*$AB$34)+$C$16,IF($U$38<$B$18,(($U$38-$B$17)*$AB$35)+$C$17,IF($U$38<$B$19,(($U$38-$B$18)*$AB$36)+$C$18)))))))","v":false},null,"Slope Log (ft/ft)","Slope Log Face (ft/ft)",null,null,null,null,null,null,null,null,null,null,null,null,null,null,null,null,null,null,null,null,null,null,null,null,null,null,29,0,{"$error":"#DIV/0!"},{"$error":"#DIV/0!"},{"$error":"#DIV/0!"},{"$error":"#DIV/0!"},{"$error":"#DIV/0!"},{"$error":"#DIV/0!"},{"$error":"#DIV/0!"},{"$error":"#DIV/0!"},{"$error":"#DIV/0!"},{"$error":"#DIV/0!"},{"$error":"#DIV/0!"},null,null,"Max","Min","cP (ft)"]
[null,null,null,null,null,null,null,null,null,null,null,null,null,null,null,null,null,null,"High Pt on Crown","No",{"$f":"IF($T$39=\"No\",0,IF($U$12>$U$11,$T$12,$T$11-($G$22*$M$19*$M$17)))","v":0},{"$f":"IF($T$39=\"No\",0,$E$22)","v":0},0,{"$f":"IF($T$39=\"No\",0,IF($U$12>=$U$11,$U$12,$U$11-($G$22*$M$20)))","v":0},{"$f":"IF($T$39=\"\",\"\",IF($U$39<$B$14,(($U$39-$B$13)*$AB$31)+$C$13,IF($U$39<$B$15,(($U$39-$B$14)*$AB$32)+$C$14,IF($U$39<$B$16,(($U$39-$B$15)*$AB$33)+$C$15,IF($U$39<$B$17,(($U$39-$B$16)*$AB$34)+$C$16,IF($U$39<$B$18,(($U$39-$B$17)*$AB$35)+$C$17,IF($U$39<$B$19,(($U$39-$B$18)*$AB$36)+$C$18)))))))","v":false},null,null,null,null,null,null,null,null,null,"Free internet tilted cylinder calculator:",null,null,null,"http://planetcalc.com/1442/",null,null,null,null,null,null,"Free internet tilted cylinder calculator:",null,null,null,"http://planetcalc.com/1442/",null,null,null,null,30,0,{"$error":"#DIV/0!"},{"$error":"#DIV/0!"},{"$error":"#DIV/0!"},{"$error":"#DIV/0!"},{"$error":"#DIV/0!"},{"$error":"#DIV/0!"},{"$error":"#DIV/0!"},{"$error":"#DIV/0!"},{"$error":"#DIV/0!"},{"$error":"#DIV/0!"},{"$error":"#DIV/0!"},null,null,{"$f":"MAX($BS$45:$BS$245)","v":0},{"$f":"MIN($BS$45:$BS$245)","v":0},{"$f":"IF($BS$43=0,0,IF(AND($BS$39=0,$BR$39=$E$22),($BR$39+$BS$39)/2,IF($BS$39=0,$BR$39-((1/3)*($BR$39-$BS$39)),IF($BR$39=$E$22,$BR$39-((2/3)*($BR$39-$BS$39)),($BR$39+$BS$39)/2))))","v":0}]
[null,null,null,null,null,null,null,null,null,null,null,null,null,null,null,null,null,null,"Low Pt on Bottom","No",{"$f":"IF($T$40=\"No\",0,IF($U$13<=$U$14,$T$13,$T$14-($G$22*$M$19*$M$17)))","v":0},0,0,{"$f":"IF($T$40=\"No\",0,IF($U$13<=$U$14,$U$13,$U$14-($G$22*$M$20)))","v":0},{"$f":"IF($T$40=\"\",\"\",IF($U$40<$B$14,(($U$40-$B$13)*$AB$31)+$C$13,IF($U$40<$B$15,(($U$40-$B$14)*$AB$32)+$C$14,IF($U$40<$B$16,(($U$40-$B$15)*$AB$33)+$C$15,IF($U$40<$B$17,(($U$40-$B$16)*$AB$34)+$C$16,IF($U$40<$B$18,(($U$40-$B$17)*$AB$35)+$C$17,IF($U$40<$B$19,(($U$40-$B$18)*$AB$36)+$C$18)))))))","v":false},null,{"$f":"IF(OR($B$25=0,$B$25=180,$B$25=360),($U$11-$U$12)/0.001,IF($X$38=$X$39,1E-25,($U$11-$U$12)/($T$11-$T$12)))","v":0},{"$f":"IF(OR($B$25=0,$B$25=180,$B$25=360),9999,IF($X$38=$X$39,1E-25,($U$12-$U$13)/($T$12-$T$13)))","v":9999},null,null,null,null,null,null,null,null,null,null,null,null,null,null,null,null,null,null,null,null,null,null,null,null,null,null,"Total",null,null,null,{"$f":"SUM(BG10:BG39)","v":{"$error":"#DIV/0!"}},null,null,null,null,{"$f":"SUM($BL$10:$BL$39)","v":{"$error":"#DIV/0!"}},null,null,{"$f":"SUM($BO$10:$BO$39)","v":{"$error":"#DIV/0!"}}]
[null,null,null,null,null,null,null,null,null,null,null,null,null,null,null,null,null,null,"High Pt on Bottom","No",{"$f":"IF($T$41=\"No\",0,IF($U$13>$U$14,$T$13,$T$14-($G$22*$M$19*$M$17)))","v":0},{"$f":"IF($T$41=\"No\",0,$E$22)","v":0},0,{"$f":"IF($T$41=\"No\",0,IF($U$13>=$U$14,$U$13,$U$14-($G$22*$M$20)))","v":0},{"$f":"IF($T$41=\"\",\"\",IF($U$41<$B$14,(($U$41-$B$13)*$AB$31)+$C$13,IF($U$41<$B$15,(($U$41-$B$14)*$AB$32)+$C$14,IF($U$41<$B$16,(($U$41-$B$15)*$AB$33)+$C$15,IF($U$41<$B$17,(($U$41-$B$16)*$AB$34)+$C$16,IF($U$41<$B$18,(($U$41-$B$17)*$AB$35)+$C$17,IF($U$41<$B$19,(($U$41-$B$18)*$AB$36)+$C$18)))))))","v":false},null,null,null,null,null,null,null,null,null,null,null,null,null,null,null,null,null,null,null,"Average",{"$f":"IF(AT42=0,0,AVERAGE(AT45:AT245))","v":0},{"$f":"IF(AU42=0,0,AVERAGE(AU45:AU245))","v":0}]
[null,null,null,null,null,null,null,null,null,null,null,null,null,null,null,null,null,null,"Low Pt on Centerline","No",{"$f":"IF($T$42=\"No\",0,AVERAGE($U$38,$U$40))","v":0},0,0,{"$f":"IF($T$42=\"No\",0,AVERAGE($X$38,$X$40))","v":0},{"$f":"IF($T$42=\"\",\"\",IF($U$42<$B$14,(($U$42-$B$13)*$AB$31)+$C$13,IF($U$42<$B$15,(($U$42-$B$14)*$AB$32)+$C$14,IF($U$42<$B$16,(($U$42-$B$15)*$AB$33)+$C$15,IF($U$42<$B$17,(($U$42-$B$16)*$AB$34)+$C$16,IF($U$42<$B$18,(($U$42-$B$17)*$AB$35)+$C$17,IF($U$42<$B$19,(($U$42-$B$18)*$AB$36)+$C$18)))))))","v":false},null,null,null,null,null,null,null,null,null,"Log Partial Area Calculations",null,null,null,null,null,null,null,null,null,"Max",{"$f":"MAX(AT45:AT245)","v":0},{"$f":"MAX(AU45:AU245)","v":0},null,null,null,"Total","Total","Total","Total","Total",null,"Total",null,"Total","Total","Average",null,"Average","Average","Average","Average","Total","Total","Total","Average","Average"]
[null,null,null,null,null,null,null,null,null,null,null,null,null,null,null,null,null,null,"High Pt on Centerline","No",{"$f":"IF($T$42=\"No\",0,AVERAGE($U$39,$U$41))","v":0},{"$f":"IF($T$43=\"No\",0,$E$22)","v":0},0,{"$f":"IF($T$42=\"No\",0,AVERAGE($X$39,$X$41))","v":0},{"$f":"IF($T$43=\"\",\"\",IF($U$43<$B$14,(($U$43-$B$13)*$AB$31)+$C$13,IF($U$43<$B$15,(($U$43-$B$14)*$AB$32)+$C$14,IF($U$43<$B$16,(($U$43-$B$15)*$AB$33)+$C$15,IF($U$43<$B$17,(($U$43-$B$16)*$AB$34)+$C$16,IF($U$43<$B$18,(($U$43-$B$17)*$AB$35)+$C$17,IF($U$43<$B$19,(($U$43-$B$18)*$AB$36)+$C$18)))))))","v":false},null,null,null,null,null,null,null,null,null,"Log Parameters",null,null,null,null,null,null,"Soil Parameters",null,null,null,null,null,null,null,null,{"$f":"SUM(AY45:AY245)","v":0},{"$f":"SUM($AZ$45:$AZ$245)","v":0},{"$f":"SUM($BA$45:$BA$245)","v":0},{"$f":"SUM($BB$45:$BB$245)","v":0},{"$f":"SUM($BC$45:$BC$245)","v":0},null,{"$f":"SUM($BE$45:$BE$245)","v":0},null,{"$f":"SUM($BG$45:$BG$245)","v":0},{"$f":"SUM($BH$45:$BH$245)","v":0},{"$f":"IF(SUM($BI$45:$BI$245)=0,0,AVERAGE($BI$45:$BI$245))","v":0},null,{"$f":"IF(SUM($BK$45:$BK$245)=0,0,AVERAGE($BK$45:$BK$245))","v":0},{"$f":"IF(SUM($BL$45:$BL$245)=0,0,AVERAGE($BL$45:$BL$245))","v":0},{"$f":"IF(SUM($BM$45:$BM$245)=0,0,AVERAGE($BM$45:$BM$245))","v":0},{"$f":"IF(SUM($BN$45:$BN$245)=0,0,AVERAGE($BN$45:$BN$245))","v":0},{"$f":"SUM(BO45:BO245)","v":0},{"$f":"SUM($BP$45:$BP$245)","v":0},{"$f":"SUM($BQ$45:$BQ$245)","v":0},{"$f":"IF(SUM($BR$45:$BR$245)=0,0,AVERAGE($BR$45:$BR$245))","v":0},{"$f":"IF(SUM($BS$45:$BS$245)=0,0,AVERAGE($BS$45:$BS$245))","v":0}]
[null,null,null,null,null,null,null,null,null,null,null,null,null,null,null,null,null,null,null,null,null,null,null,null,null,null,null,null,null,null,null,null,null,null,"Point","Distance","Zone","xcrown (ft)","ycrown (ft)","xbottom (ft)","ybottom (ft)","ysoil (ft)","db,dry,crown (ft)","db,sat,crown (ft)","db,crown (ft)","db,crown,bed (ft)","db,crown,bank (ft)","db,dry,bottom (ft)","db,sat,bottom (ft)","db,bottom (ft)","LT,em (ft)","Vbed,dry (ft3)","Vbed,sat (ft3)","Vbank,dry (ft3)","Vbank,sat (ft3)","hb,TS (ft)","ATSp,em (ft2)","dTSp,dry,em (ft)","ATSp,dry,em (ft2)","LT,ex (ft)","cD (ft)","hT↑bed,ex,wet (ft)","CL (ft)","cL (ft)","zT,CL↓WSE","CW","LTf,tot (ft)","LTf,bed (ft)","LTf,banks (ft)","cF (ft)","csoil (ft)"]
[null,null,null,null,null,null,null,null,null,null,null,null,null,null,null,null,null,null,null,null,null,"Log Crown and Soil Intercept",null,"Dist to Intercept","Intercept in Zone?","LW Buried?","Exposed Segment",null,null,"Large Wood Centerline",null,null,null,null,0,{"$f":"($AI45/$AI$245)*$AJ$245","v":0},{"$f":"IF(OR($C$19=\"\",$F$25=\"\",$G$25=\"\"),\"None\",IF(AL45<$B$14,\"Left Floodplain\",IF(AL45<$B$15,\"Left Bank\",IF(AL45<$B$16,\"Left Stream Bed\",IF(AL45<$B$17,\"Right Stream Bed\",IF(AL45<$B$18,\"Right Bank\",\"Right Floodplain\"))))))","v":"None"},{"$f":"MIN($U$38:$U$39)","v":0},{"$f":"IF($U$38<=$U$39,$X$38,$X$39)","v":0},{"$f":"MIN($U$40:$U$41)","v":0},{"$f":"IF($U$40<=$U$41,$X$40,$X$41)","v":0},{"$f":"IF($AL45<$B$14,(($AL45-$B$13)*$AB$31)+$C$13,IF($AL45<$B$15,(($AL45-$B$14)*$AB$32)+$C$14,IF($AL45<$B$16,(($AL45-$B$15)*$AB$33)+$C$15,IF($AL45<$B$17,(($AL45-$B$16)*$AB$34)+$C$16,IF($AL45<$B$18,(($AL45-$B$17)*$AB$35)+$C$17,IF($AL45<$B$19,(($AL45-$B$18)*$AB$36)+$C$18))))))","v":false},{"$f":"IF(OR($AP45<$AE$12,$AP45<=$AM45),0,IF(OR($AP45>=$AE$12,$AM45>=$AE$12),$AP45-$AM45-$AR45,$AP45-$AE$12))","v":0},{"$f":"IF($AP45<=$AM45,0,IF($AM45>=$AE$12,0,IF($AP45<=$AE$12,$AP45-$AM45,$AE$12-$AM45)))","v":0},{"$f":"IF(AP45<=AM45,0,AP45-AM45)","v":0},{"$f":"IF(OR($AS45=\"\",$AS45=0),\"\",IF(OR($AK45=\"Left Stream Bed\",$AK45=\"Right Stream Bed\"),$AS45,\"\"))","v":""},{"$f":"IF(OR($AS45=\"\",$AS45=0),\"\",IF(OR($AK45=\"Left Floodplain\",$AK45=\"Left Bank\",$AK45=\"Right Bank\",$AK45=\"Right Floodplain\"),$AS45,\"\"))","v":""},{"$f":"IF(OR($AP45<$AE$12,$AP45<=$AO45),0,IF($AO45>=$AE$12,$AP45-$AO45,$AP45-$AE$12))","v":0},{"$f":"IF($AP45<=$AO45,0,IF($AO45>=$AE$12,0,IF($AP45<=$AE$12,$AP45-$AO45,$AE$12-$AO45)))","v":0},{"$f":"IF(AP45<=AO45,0,AP45-AO45)","v":0},{"$f":"IF($AS45=0,0,IF(OR($AJ45=0,$AJ45=$E$22),$AJ$46/2,$AJ$46))","v":0},{"$f":"IF(OR($AK45=\"Left Stream Bed\",$AK45=\"Right Stream Bed\"),$F$22*$AQ45*$AY45,0)","v":0},{"$f":"IF(OR($AK45=\"Left Stream Bed\",$AK45=\"Right Stream Bed\"),$F$22*$AR45*$AY45,0)","v":0},{"$f":"IF(OR($AK45=\"Left Floodplain\",$AK45=\"Left Bank\",$AK45=\"Right Bank\",$AK45=\"Right Floodplain\"),$F$22*$AQ45*$AY45,0)","v":0},{"$f":"IF(OR($AK45=\"Left Floodplain\",$AK45=\"Left Bank\",$AK45=\"Right Bank\",$AK45=\"Right Floodplain\"),$F$22*$AR45*$AY45,0)","v":0},{"$f":"AX45-AS45","v":0},{"$f":"$BD45*$AJ$46*ABS($M$17)","v":0},{"$f":"AV45-AQ45","v":0},{"$f":"IF(OR($AJ45=0,$AJ45=$E$22),($BF45*$AJ$46/2)*ABS($M$17),$BF45*$AJ$46*ABS($M$17))","v":0},{"$f":"IF(OR($AM45<$AP45,$AO45>$AE$8),\"\",IF(OR($AJ45=0,$AJ45=$E$22),$AJ$46/2,$AJ$46))","v":""},{"$f":"IF($BH45=\"\",\"\",IF($BH45>0,$AJ45,\"\"))","v":""},{"$f":"IF($BH45=\"\",\"\",IF(OR(($AO45-$AP45)<0,$AO$45>=$AE$8),0,($AO45-$AP45)))","v":""},{"$f":"IF($BJ45=\"\",\"\",IF(OR($BJ45>($F$22/2),$BJ45=0),0,0.45-($BJ45*0.45/($F$22/2))))","v":""},{"$f":"IF($BK45=\"\",\"\",IF($BK45>0,$AJ45,\"\"))","v":""},{"$f":"IF($BH45=\"\",\"\",IF(OR(($AM45-$AP45)<0,$AM45>=$AE$8),\"\",($AE$8-($AM45-(($F$22/2)/$M$19)))))","v":""},{"$f":"IF($BM45=\"\",\"\",(((PI()^2)/32)*($B$66^-6)*EXP(-($BM45/$F$22)/(2*($B$66^2)))))","v":""},{"$f":"IF($AO45=0,0,IF($AO45>$AP45,0,IF(OR($AJ45=0,$AJ45=$E$22),$AJ$46/2,$AJ$46)))","v":0},{"$f":"IF(AND($BO45>0,OR($AK45=\"Left Stream Bed\",$AK45=\"Right Stream Bed\")),$BO45,0)","v":0},{"$f":"IF(AND($BO45>0,OR($AK45=\"Left Floodplain\",$AK45=\"Left Bank\",$AK45=\"Right Bank\",$AK45=\"Right Floodplain\")),$BO45,0)","v":0},{"$f":"IF($BO45>0,$AJ45,\"\")","v":""},{"$f":"IF($AY45>0,$AJ45,\"\")","v":""}]
[null,null,null,null,null,null,null,null,null,null,null,null,null,null,null,null,null,null,null,"Zone L (ft)","Log L (ft)","xcrown (ft)","ycrown (ft)",null,null,null,null,"Lem,crown (ft)",null,null,"x (ft)","y (ft)",null,null,1,{"$f":"($AI46/$AI$245)*$AJ$245","v":0},"None",{"$f":"$AL$45+ABS(AJ46*$M$19*$M$17)","v":0},{"$f":"AM45+((AL46-AL45)*$AA$40)","v":0},{"$f":"$AN$45+ABS(AJ46*$M$19*$M$17)","v":0},{"$f":"AO45+((AN46-AN45)*$AA$40)","v":0},{"$f":"IF($AL46<$B$14,(($AL46-$B$13)*$AB$31)+$C$13,IF($AL46<$B$15,(($AL46-$B$14)*$AB$32)+$C$14,IF($AL46<$B$16,(($AL46-$B$15)*$AB$33)+$C$15,IF($AL46<$B$17,(($AL46-$B$16)*$AB$34)+$C$16,IF($AL46<$B$18,(($AL46-$B$17)*$AB$35)+$C$17,IF($AL46<$B$19,(($AL46-$B$18)*$AB$36)+$C$18))))))","v":false},0,0,{"$f":"IF(AP46<=AM46,0,AP46-AM46)","v":0},{"$f":"IF(OR($AS46=\"\",$AS46=0),\"\",IF(OR($AK46=\"Left Stream Bed\",$AK46=\"Right Stream Bed\"),$AS46,\"\"))","v":""},{"$f":"IF(OR($AS46=\"\",$AS46=0),\"\",IF(OR($AK46=\"Left Floodplain\",$AK46=\"Left Bank\",$AK46=\"Right Bank\",$AK46=\"Right Floodplain\"),$AS46,\"\"))","v":""},{"$f":"IF(OR($AP46<$AE$12,$AP46<=$AO46),0,IF($AO46>=$AE$12,$AP46-$AO46,$AP46-$AE$12))","v":0},0,0,0,0,0,0,0,0,{"$f":"$BD46*$AJ$46*ABS($M$17)","v":0},{"$f":"AV46-AQ46","v":0},0,"",{"$f":"IF($BH46=\"\",\"\",IF($BH46>0,$AJ46,\"\"))","v":""},{"$f":"IF($BH46=\"\",\"\",IF(OR(($AO46-$AP46)<0,$AO$45>=$AE$8),0,($AO46-$AP46)))","v":""},"","",{"$f":"IF($BH46=\"\",\"\",IF(OR(($AM46-$AP46)<0,$AM46>=$AE$8),\"\",($AE$8-($AM46-(($F$22/2)/$M$19)))))","v":""},{"$f":"IF($BM46=\"\",\"\",(((PI()^2)/32)*($B$66^-6)*EXP(-($BM46/$F$22)/(2*($B$66^2)))))","v":""},0,0,0,"",{"$f":"IF($AY46>0,$AJ46,\"\")","v":""}]
[null,null,null,null,null,null,null,null,null,null,null,null,null,null,null,null,null,null,"LB Floodplain",{"$f":"($B$14-$B$13)/ABS($M$17)/ABS($M$19)","v":{"$error":"#DIV/0!"}},{"$f":"IF(MAX($U$38:$U$39)<=$B$14,$E$22,IF($T$32=\"No\",0,$E$22-$W$32))","v":0},{"$f":"IF($U$47=0,0,IF(OR($B$25=0,$B$25=180,$B$25=360),$U$38,$U$32+(($X$32-$C$14)/($AB$31-$AA$40))))","v":0},{"$f":"IF($U$47=0,0,IF(OR($B$25=0,$B$25=180,$B$25=360),(($U$38-$B$13)*$AB$31)+$C$13,$X$32+(($V$47-$U$32)*$AA$40)))","v":0},{"$f":"IF($U$47=0,0,IF(OR($B$25=0,$B$25=180,$B$25=360),$E$22-ABS(($X$39-$W$47)/$M$20),IF(AND($U$38<=$U$39,$X$38>=$Y$38),ABS(($X$38-$W$47)/($AA$40*$M$17*$M$19)),IF(AND($U$38<=$U$39,$X$38<$Y$38),ABS($E$22-(ABS(($X$38-$W$47)/($AA$40*$M$17*$M$19)))),IF(AND($U$38>$U$39,$X$39>=$Y$39),ABS(($X$39-$W$47)/($AA$40*$M$17*$M$19)),IF(AND($U$38>=$U$39,$X$39<$Y$39),ABS($E$22-(ABS(($X$38-$W$47)/($AA$40*$M$17*$M$19))))))))))","v":0},{"$f":"IF(AND($U$47=0,$W$47=0),\"No\",IF(AND($V$47<=$B$14,$V$47>=$B$13,$V$47>=MIN($U$38:$U$39),$V$47<=MAX($U$38:$U$39),$W$47<$C$13,$X$47<=$E$22),\"Yes\",\"No\"))","v":"No"},{"$f":"IF($U$47=0,\"No\",IF($Y$47=\"Yes\",\"Partial\",IF(AND($U$47<$E$22,$X$39<$Y$39,$Y$47=\"No\",$Y$48=\"No\",$Y$49=\"No\",$Y$50=\"No\",$Y$51=\"No\",$Y$52=\"No\"),\"Yes\",IF(AND($Y$47=\"No\",$X$32>$Y$32),\"No\",\"Yes\"))))","v":"No"},{"$f":"IF($Z$47=\"Yes\",\"None\",IF(AND($Z$47=\"No\",$U$47=0),\"None\",IF($Z$47=\"No\",\"All\",IF(AND($X$39>=$Y$39,$U$39<=$U$38),\"Left\",\"Right\"))))","v":"None"},{"$f":"IF($U$47=0,0,IF($Z$47=\"No\",0,IF($Z$47=\"Yes\",$U$47,IF(OR($AA$47=\"Left\",$U$47=$E$22),$U$47-(ABS(($U$39-$V$47)/($M$17*$M$19))),$U$47-(ABS(($V$47-$B$14)/($M$17*$M$19)))))))","v":0},null,"Rootwad",{"$f":"AVERAGE(T10,T15)","v":0},{"$f":"AVERAGE(U10,U15)","v":0},null,null,2,0,"None",{"$f":"$AL$45+ABS(AJ47*$M$19*$M$17)","v":0},{"$f":"AM46+((AL47-AL46)*$AA$40)","v":0},0,{"$f":"AO46+((AN47-AN46)*$AA$40)","v":0},{"$f":"IF($AL47<$B$14,(($AL47-$B$13)*$AB$31)+$C$13,IF($AL47<$B$15,(($AL47-$B$14)*$AB$32)+$C$14,IF($AL47<$B$16,(($AL47-$B$15)*$AB$33)+$C$15,IF($AL47<$B$17,(($AL47-$B$16)*$AB$34)+$C$16,IF($AL47<$B$18,(($AL47-$B$17)*$AB$35)+$C$17,IF($AL47<$B$19,(($AL47-$B$18)*$AB$36)+$C$18))))))","v":false},0,0,0,"","",0,0,0,0,0,0,0,0,0,0,0,0,"","","","","","",{"$f":"IF($BM47=\"\",\"\",(((PI()^2)/32)*($B$66^-6)*EXP(-($BM47/$F$22)/(2*($B$66^2)))))","v":""},0,0,0,"",""]
[{"$f":"IF($A$6=\"\",\"\",$A$6)","v":""},{"$f":"IF($A$6=\"\",\"\",$B$6)","v":""},null,{"$f":"IF(OR($B$9=\"N/A\",$B$9=\"\"),\"\",$B$9)","v":""},{"$f":"IF($D$48=\"\",\"\",\"Log ID\")","v":""},{"$f":"IF($D$48=\"\",\"\",$C$9)","v":""},null,null,null,"Page 2",null,null,null,null,null,null,null,null,"Left Bank",{"$f":"($B$15-$B$14)/ABS($M$17)/ABS($M$19)","v":{"$error":"#DIV/0!"}},{"$f":"IF(AND(MIN($U$38:$U$39)>=$B$14,MAX($U$38:$U$39)<=$B$15),$E$22,IF(AND($T$33=\"No\",$T$32=\"No\"),0,$E$22-$W$33-$U$47))","v":0},{"$f":"IF($U$48=0,0,IF(OR($B$25=0,$B$25=180,$B$25=360),$U$38,$U$33+(($C$15-$X$33)/($AA$40-$AB$32))))","v":0},{"$f":"IF($U$48=0,0,IF(OR($B$25=0,$B$25=180,$B$25=360),(($U$38-$B$14)*$AB$32)+$C$14,$X$33+(($V$48-$U$33)*$AA$40)))","v":0},{"$f":"IF($U$48=0,0,IF(OR($B$25=0,$B$25=180,$B$25=360),$E$22-ABS(($X$39-$W$48)/$M$20),IF(AND($U$38<=$U$39,$X$38>=$Y$38),ABS(($X$38-$W$48)/($AA$40*$M$17*$M$19)),IF(AND($U$38<=$U$39,$X$38<$Y$38),ABS($E$22-(ABS(($X$38-$W$48)/($AA$40*$M$17*$M$19)))),IF(AND($U$38>$U$39,$X$39>=$Y$39),ABS(($X$39-$W$48)/($AA$40*$M$17*$M$19)),IF(AND($U$38>=$U$39,$X$39<$Y$39),ABS($E$22-(ABS(($X$38-$W$48)/($AA$40*$M$17*$M$19))))))))))","v":0},{"$f":"IF(AND($U$48=0,$W$48=0),\"No\",IF(AND($V$48<=$B$15,$V$48>=$B$14,$V$48>=MIN($U$38:$U$39),$V$48<=MAX($U$38:$U$39),$W$48<$C$14,$X$48<=$E$22),\"Yes\",\"No\"))","v":"No"},{"$f":"IF($U$48=0,\"No\",IF($Y$48=\"Yes\",\"Partial\",IF(AND($U$48<$E$22,$X$39<$Y$39,$Y$47=\"No\",$Y$48=\"No\",$Y$49=\"No\",$Y$50=\"No\",$Y$51=\"No\",$Y$52=\"No\"),\"Yes\",IF(AND($Y$48=\"No\",$X$33>$Y$33),\"No\",\"Yes\"))))","v":"No"},{"$f":"IF($Z$48=\"Yes\",\"None\",IF(AND($Z$48=\"No\",$U$48=0),\"None\",IF($Z$48=\"No\",\"All\",IF(AND($X$39>=$Y$39,$U$39<=$U$38,$AA$47<>\"Left\"),\"Left\",\"Right\"))))","v":"None"},{"$f":"IF($U$48=0,0,IF($Z$48=\"No\",0,IF($Z$48=\"Yes\",$U$48,IF(OR($U$48=$E$22,AND($AA$48=\"Left\",MIN($U$38:$U$39)>=$B$14,MAX($U$38:$U$39)>=$B$15)),$U$48-(ABS(($U$39-$V$48)/($M$17*$M$19))),IF($AA$48=\"Left\",$U$48-(ABS(($B$14-$V$48)/($M$17*$M$19))),IF(MAX($U$38:$U$39)>=$B$15,$U$48-(ABS(($V$48-$B$15)/($M$17*$M$19))),ABS(($V$48-$B$14)/($M$17*$M$19))))))))","v":0},null,"Root collar",{"$f":"AVERAGE(T11,T14)","v":0},{"$f":"AVERAGE(U11,U14)","v":0},null,null,3,0,"None",{"$f":"$AL$45+ABS(AJ48*$M$19*$M$17)","v":0},0,0,0,false,0,0,0,"","",0,0,0,0,0,0,0,0,0,0,0,0,"","","","","","","",0,0,0,"",""]
["Vertical Force Analysis",null,null,null,null,null,null,null,null,null,null,null,null,null,null,null,null,null,"Left Stream Bed",{"$f":"($B$16-$B$15)/ABS($M$17)/ABS($M$19)","v":{"$error":"#DIV/0!"}},{"$f":"IF(AND(MIN($U$38:$U$39)>=$B$15,MAX($U$38:$U$39)<=$B$16),$E$22,IF(AND($T$34=\"No\",$T$33=\"No\"),0,IF(AND($T$33=\"Yes\",$T$34=\"No\"),$E$22-$U$48-$U$47,IF(AND($T$33=\"Yes\",$T$34=\"Yes\",$T$36=\"No\"),$E$22-$U$50-$U$48-$U$47,IF(AND($T$33=\"Yes\",$T$34=\"Yes\",$T$36=\"Yes\"),$E$22-$U$52-$U$51-$U$50-$U$48-$U$47,$E$22-$U$52-$U$51-$U$50)))))","v":0},{"$f":"IF($U$49=0,0,IF(OR($B$25=0,$B$25=180,$B$25=360),$U$38,$U$34+(($C$16-$X$34)/($AA$40-$AB$33))))","v":0},{"$f":"IF($U$49=0,0,IF(OR($B$25=0,$B$25=180,$B$25=360),(($U$38-$B$15)*$AB$33)+$C$15,$X$34+(($V$49-$U$34)*$AA$40)))","v":0},{"$f":"IF(OR($U$49=0,AND($C$25=0,$B$25=0),AND($C$25=0,$B$25=360),AND($C$25=0,$B$25=180)),0,IF(OR($B$25=0,$B$25=180,$B$25=360),$E$22-ABS(($X$39-$W$49)/$M$20),IF(AND($U$38<=$U$39,$X$38>=$Y$38),ABS(($X$38-$W$49)/($AA$40*$M$17*$M$19)),IF(AND($U$38<=$U$39,$X$38<$Y$38),ABS($E$22-(ABS(($X$38-$W$49)/($AA$40*$M$17*$M$19)))),IF(AND($U$38>$U$39,$X$39>=$Y$39),ABS(($X$39-$W$49)/($AA$40*$M$17*$M$19)),IF(AND($U$38>=$U$39,$X$39<$Y$39),ABS($E$22-(ABS(($X$38-$W$49)/($AA$40*$M$17*$M$19))))))))))","v":0},{"$f":"IF(AND($U$49=0,$W$49=0),\"No\",IF(AND($V$49<=$B$16,$V$49>=$B$15,$V$49>=MIN($U$38:$U$39),$V$49<=MAX($U$38:$U$39),$W$49<$C$15,$X$49<=$E$22),\"Yes\",\"No\"))","v":"No"},{"$f":"IF($U$49=0,\"No\",IF($Y$49=\"Yes\",\"Partial\",IF(AND($U$49<$E$22,$X$39<$Y$39,$Y$47=\"No\",$Y$48=\"No\",$Y$49=\"No\",$Y$50=\"No\",$Y$51=\"No\",$Y$52=\"No\"),\"Yes\",IF(AND($Y$49=\"No\",$X$34>$Y$34),\"No\",\"Yes\"))))","v":"No"},{"$f":"IF($Z$49=\"Yes\",\"None\",IF(AND($Z$49=\"No\",$U$49=0),\"None\",IF($Z$49=\"No\",\"All\",IF(AND($X$39>=$Y$39,$U$39<=$U$38,$AA$48<>\"Left\"),\"Left\",\"Right\"))))","v":"None"},{"$f":"IF($U$49=0,0,IF($Z$49=\"No\",0,IF($Z$49=\"Yes\",$U$49,IF(OR($U$49=$E$22,AND($AA$49=\"Left\",MIN($U$38:$U$39)>=$B$15,MAX($U$38:$U$39)>=$B$16)),$U$49-(ABS(($U$39-$V$49)/($M$17*$M$19))),IF($AA$49=\"Left\",$U$49-(ABS(($B$15-$V$49)/($M$17*$M$19))),IF(MAX($U$38:$U$39)>=$B$16,$U$49-(ABS(($V$49-$B$16)/($M$17*$M$19))),ABS(($V$49-$B$15)/($M$17*$M$19))))))))","v":0},null,"Stem tip",{"$f":"AVERAGE(T12,T13)","v":0},{"$f":"AVERAGE(U12,U13)","v":0},null,null,4,0,"None",0,0,0,0,false,0,0,0,"","",0,0,0,0,0,0,0,0,0,0,0,0,"","","","","","","",0,0,0,"",""]
["Net Buoyancy Force",null,null,null,null,null,null,"Lift Force",null,null,null,null,null,null,null,null,null,null,"Right Stream Bed",{"$f":"($B$17-$B$16)/ABS($M$17)/ABS($M$19)","v":{"$error":"#DIV/0!"}},{"$f":"IF(AND(MIN($U$38:$U$39)>=$B$16,MAX($U$38:$U$39)<=$B$17),$E$22,IF(AND($T$35=\"No\",$T$36=\"No\"),0,IF(AND($T$36=\"Yes\",$T$35=\"No\"),$E$22-$U$51-$U$52,IF(AND($T$36=\"Yes\",$T$35=\"Yes\"),$E$22-$W$35-$U$51-$U$52,$E$22-$W$35))))","v":0},{"$f":"IF($U$50=0,0,IF(OR($B$25=0,$B$25=180,$B$25=360),$U$38,$U$35+(($X$35-$C$16)/($AB$34-$AA$40))))","v":0},{"$f":"IF($U$50=0,0,IF(OR($B$25=0,$B$25=180,$B$25=360),(($U$38-$B$16)*$AB$34)+$C$16,$X$35+(($V$50-$U$35)*$AA$40)))","v":0},{"$f":"IF(OR($U$50=0,AND($C$25=0,$B$25=0),AND($C$25=0,$B$25=360),AND($C$25=0,$B$25=180)),0,IF(OR($B$25=0,$B$25=180,$B$25=360),$E$22-ABS(($X$39-$W$50)/$M$20),IF(AND($U$38<=$U$39,$X$38>=$Y$38),ABS(($X$38-$W$50)/($AA$40*$M$17*$M$19)),IF(AND($U$38<=$U$39,$X$38<$Y$38),ABS($E$22-(ABS(($X$38-$W$50)/($AA$40*$M$17*$M$19)))),IF(AND($U$38>$U$39,$X$39>=$Y$39),ABS(($X$39-$W$50)/($AA$40*$M$17*$M$19)),IF(AND($U$38>=$U$39,$X$39<$Y$39),ABS($E$22-(ABS(($X$38-$W$50)/($AA$40*$M$17*$M$19))))))))))","v":0},{"$f":"IF(AND($U$50=0,$W$50=0),\"No\",IF(AND($V$50<=$B$17,$V$50>=$B$16,$V$50>=MIN($U$38:$U$39),$V$50<=MAX($U$38:$U$39),$W$50<$C$17,$X$50<=$E$22),\"Yes\",\"No\"))","v":"No"},{"$f":"IF($U$50=0,\"No\",IF($Y$50=\"Yes\",\"Partial\",IF(AND($U$50<$E$22,$X$39<$Y$39,$Y$47=\"No\",$Y$48=\"No\",$Y$49=\"No\",$Y$50=\"No\",$Y$51=\"No\",$Y$52=\"No\"),\"Yes\",IF(AND($Y$50=\"No\",$X$35>$Y$35),\"No\",\"Yes\"))))","v":"No"},{"$f":"IF($Z$50=\"Yes\",\"None\",IF(AND($Z$50=\"No\",$U$50=0),\"None\",IF($Z$50=\"No\",\"All\",IF(AND($X$39>=$Y$39,$U$39>=$U$38,$AA$51<>\"Right\"),\"Right\",\"Left\"))))","v":"None"},{"$f":"IF($U$50=0,0,IF($Z$50=\"No\",0,IF($Z$50=\"Yes\",$U$50,IF(OR($U$50=$E$22,AND($AA$50=\"Right\",MIN($U$38:$U$39)<=$B$16,MAX($U$38:$U$39)<=$B$17)),$U$50-(ABS(($U$39-$V$50)/($M$17*$M$19))),IF($AA$50=\"Right\",$U$50-(ABS(($B$17-$V$50)/($M$17*$M$19))),IF(MIN($U$38:$U$39)<=$B$16,$U$50-(ABS(($V$50-$B$16)/($M$17*$M$19))),ABS(($V$50-$B$17)/($M$17*$M$19))))))))","v":0},null,null,null,null,null,null,5,0,"None",0,0,0,0,false,0,0,0,"","",0,0,0,0,0,0,0,0,0,0,0,0,"","","","","","","",0,0,0,"",""]
["Wood","VTS (ft3)","VRW (ft3)","VT (ft3)","WT (lbf)","FB (lbf)",null,"CLT",{"$f":"$BK$43","v":0},null,null,null,null,{"$f":"IF(OR($D$22=\"\",$D$22=\"No\"),\"\",\"Rootwad Position\")","v":""},null,null,null,null,"Right Bank",{"$f":"($B$18-$B$17)/ABS($M$17)/ABS($M$19)","v":{"$error":"#DIV/0!"}},{"$f":"IF(AND(MIN($U$38:$U$39)>=$B$17,MAX($U$38:$U$39)<=$B$18),$E$22,IF(AND($T$36=\"No\",$T$37=\"No\"),0,$E$22-$W$36-$U$52))","v":0},{"$f":"IF($U$51=0,0,IF(OR($B$25=0,$B$25=180,$B$25=360),$U$38,$U$36+(($X$36-$C$17)/($AB$35-$AA$40))))","v":0},{"$f":"IF($U$51=0,0,IF(OR($B$25=0,$B$25=180,$B$25=360),(($U$38-$B$17)*$AB$35)+$C$17,$X$36+(($V$51-$U$36)*$AA$40)))","v":0},{"$f":"IF($U$51=0,0,IF(OR($B$25=0,$B$25=180,$B$25=360),$E$22-ABS(($X$39-$W$51)/$M$20),IF(AND($U$38<=$U$39,$X$38>=$Y$38),ABS(($X$38-$W$51)/($AA$40*$M$17*$M$19)),IF(AND($U$38<=$U$39,$X$38<$Y$38),ABS($E$22-(ABS(($X$38-$W$51)/($AA$40*$M$17*$M$19)))),IF(AND($U$38>$U$39,$X$39>=$Y$39),ABS(($X$39-$W$51)/($AA$40*$M$17*$M$19)),IF(AND($U$38>=$U$39,$X$39<$Y$39),ABS($E$22-(ABS(($X$38-$W$51)/($AA$40*$M$17*$M$19))))))))))","v":0},{"$f":"IF(AND($U$51=0,$W$51=0),\"No\",IF(AND($V$51<=$B$18,$V$51>=$B$17,$V$51>=MIN($U$38:$U$39),$V$51<=MAX($U$38:$U$39),$W$51<$C$18,$X$51<=$E$22),\"Yes\",\"No\"))","v":"No"},{"$f":"IF($U$51=0,\"No\",IF($Y$51=\"Yes\",\"Partial\",IF(AND($U$51<$E$22,$X$39<$Y$39,$Y$47=\"No\",$Y$48=\"No\",$Y$49=\"No\",$Y$50=\"No\",$Y$51=\"No\",$Y$52=\"No\"),\"Yes\",IF(AND($Y$51=\"No\",$X$36>$Y$36),\"No\",\"Yes\"))))","v":"No"},{"$f":"IF($Z$51=\"Yes\",\"None\",IF(AND($Z$51=\"No\",$U$51=0),\"None\",IF($Z$51=\"No\",\"All\",IF(AND($X$39>=$Y$39,$U$39>=$U$38,$AA$52<>\"Right\"),\"Right\",\"Left\"))))","v":"None"},{"$f":"IF($U$51=0,0,IF($Z$51=\"No\",0,IF($Z$51=\"Yes\",$U$51,IF(OR($U$51=$E$22,AND($AA$51=\"Right\",MIN($U$38:$U$39)<=$B$17,MAX($U$38:$U$39)<=$B$18)),$U$51-(ABS(($U$39-$V$51)/($M$17*$M$19))),IF($AA$51=\"Right\",$U$51-(ABS(($B$18-$V$51)/($M$17*$M$19))),IF(MIN($U$38:$U$39)<=$B$17,$U$51-(ABS(($V$51-$B$17)/($M$17*$M$19))),ABS(($V$51-$B$18)/($M$17*$M$19))))))))","v":0},null,null,null,null,null,null,6,0,"None",0,0,0,0,false,0,0,0,"","",0,0,0,0,0,0,0,0,0,0,0,0,"","","","","","","",0,0,0,"",""]
["↑WSE",{"$f":"IF(OR($E$22=\"\",$F$22=\"\"),0,IF($AH$17=\"Case 1\",$AL$17-$AJ$21,IF($AH$17=\"Case 2\",$AL$17-$AJ$26,IF($AH$17=\"Case 3\",$AL$17-$AJ$30,IF($AH$17=\"Case 4\",$AL$17-$AJ$37,IF($AH$17=\"Log is completely submerged\",0,IF($AH$17=\"Stem is dry\",PI()*(($F$22/2)^2)*($E$22-$G$22),\"\")))))))","v":0},{"$f":"IF(OR($E$22=\"\",$F$22=\"\",$D$22=\"No\",$D$22=\"\"),0,$BL$40*(1-RWporosity))","v":0},{"$f":"B52+C52","v":0},{"$f":"IF($I$22=\"\",0,($B$52*$I$22)+($C$52*$I$22))","v":0},0,null,"FL (lbf)",{"$f":"IF($J$6=\"\",0,$I$51*$J$25*SWWater*(($J$6^2)/(2*g)))","v":0},null,null,null,null,{"$f":"IF($D$22=\"\",\"\",IF($D$22=\"No\",\"No Rootwad\",IF($U$15>=$AE$8,\"Above high water\",IF($U$10<=$C$16,\"Buried in bed\",IF(OR($AE$48<=$B$14,$AE$48>=$B$18),\"On bank/buried in bank\",\"Exposed in stream\")))))","v":""},null,null,null,null,"RB Floodplain",{"$f":"($B$19-$B$18)/ABS($M$17)/ABS($M$19)","v":{"$error":"#DIV/0!"}},{"$f":"IF(MIN($U$38:$U$39)>=$B$18,$E$22,IF($T$37=\"No\",0,$E$22-$W$37))","v":0},{"$f":"IF($U$52=0,0,IF(OR($B$25=0,$B$25=180,$B$25=360),$U$38,$U$37+(($X$37-$C$18)/($AB$36-$AA$40))))","v":0},{"$f":"IF($U$52=0,0,IF(OR($B$25=0,$B$25=180,$B$25=360),(($U$38-$B$18)*$AB$36)+$C$18,$X$37+(($V$52-$U$37)*$AA$40)))","v":0},{"$f":"IF($U$52=0,0,IF(OR($B$25=0,$B$25=180,$B$25=360),$E$22-ABS(($X$39-$W$52)/$M$20),IF(AND($U$38<=$U$39,$X$38>=$Y$38),ABS(($X$38-$W$52)/($AA$40*$M$17*$M$19)),IF(AND($U$38<=$U$39,$X$38<$Y$38),ABS($E$22-(ABS(($X$38-$W$52)/($AA$40*$M$17*$M$19)))),IF(AND($U$38>$U$39,$X$39>=$Y$39),ABS(($X$39-$W$52)/($AA$40*$M$17*$M$19)),IF(AND($U$38>=$U$39,$X$39<$Y$39),ABS($E$22-(ABS(($X$38-$W$52)/($AA$40*$M$17*$M$19))))))))))","v":0},{"$f":"IF(AND($U$52=0,$W$52=0),\"No\",IF(AND($V$52<=$B$19,$V$52>=$B$18,$V$52>=MIN($U$38:$U$39),$V$52<=MAX($U$38:$U$39),$W$52<$C$19,$X$52<=$E$22),\"Yes\",\"No\"))","v":"No"},{"$f":"IF($U$52=0,\"No\",IF($Y$52=\"Yes\",\"Partial\",IF(AND($U$52<$E$22,$X$39<$Y$39,$Y$47=\"No\",$Y$48=\"No\",$Y$49=\"No\",$Y$50=\"No\",$Y$51=\"No\",$Y$52=\"No\"),\"Yes\",IF(AND($Y$52=\"No\",$X$37>$Y$37),\"No\",\"Yes\"))))","v":"No"},{"$f":"IF($Z$52=\"Yes\",\"None\",IF(AND($Z$52=\"No\",$U$52=0),\"None\",IF($Z$52=\"No\",\"All\",IF(AND($X$39>=$Y$39,$U$39>=$U$38),\"Right\",\"Left\"))))","v":"None"},{"$f":"IF($U$52=0,0,IF($Z$52=\"No\",0,IF($Z$52=\"Yes\",$U$52,IF(OR($AA$52=\"Right\",$U$52=$E$22),$U$52-(ABS(($U$39-$V$52)/($M$17*$M$19))),$U$52-(ABS(($V$52-$B$18)/($M$17*$M$19)))))))","v":0},null,null,null,null,null,null,7,0,"None",0,0,0,0,false,0,0,0,"","",0,0,0,0,0,0,0,0,0,0,0,0,"","","","","","","",0,0,0,"",""]
["↓WS↑Thw",{"$f":"IF(OR($E$22=\"\",$F$22=\"\"),0,IF(AND(MIN($U$10:$U$15)>=$C$16,MAX($U$10:$U$15)<=$AE$8),PI()*(($F$22/2)^2)*($E$22-$G$22),(PI()*(($F$22/2)^2)*($E$22-$G$22))-$B$52-$B$54))","v":0},{"$f":"IF(OR($F$22=\"\",$D$22=\"No\"),0,((1/3)*PI()*(($H$22/2)^2+($F$22/2)^2+(($H$22/2)*($F$22/2)))*$G$22*(1-RWporosity))-$C$52-$C$54)","v":0},{"$f":"B53+C53","v":0},{"$f":"IF($I$22=\"\",0,($B$53*$I$22)+($C$53*$I$22))","v":0},{"$f":"($D$53*SWWater)","v":0},null,"Vertical Force Balance",null,null,null,"Formatting",null,null,null,null,null,null,null,"L check",{"$f":"SUM(U47:U52)","v":0},{"$f":"IF($U$53=$E$22,\"OK\",\"ERROR\")","v":"OK"},null,null,null,null,"Total",{"$f":"SUM(AB47:AB52)","v":0},null,null,null,null,null,null,8,0,"None",0,0,0,0,false,0,0,0,"","",0,0,0,0,0,0,0,0,0,0,0,0,"","","","","","","",0,0,0,"",""]
["↓Thalweg",{"$f":"IF(OR($E$22=\"\",$F$22=\"\"),0,IF($AS$17=\"Case 1\",$AU$21,IF($AS$17=\"Case 2\",$AU$26,IF($AS$17=\"Case 3\",$AU$30,IF($AS$17=\"Case 4\",$AU$37,IF($AS$17=\"Log is completely submerged\",PI()*(($F$22/2)^2)*($E$22-$G$22),IF($AS$17=\"Stem is dry\",0,\"\")))))))","v":0},{"$f":"IF(OR($E$22=\"\",$F$22=\"\",$D$22=\"No\",$D$22=\"\"),0,$BO$40*(1-RWporosity))","v":0},{"$f":"B54+C54","v":0},{"$f":"IF($J$22=\"\",0,($B$54*$J$22)+($C$54*$J$22))","v":0},{"$f":"($D$54*SWWater)","v":0},null,"FB (lbf)",{"$f":"$F$55","v":0},{"$f":"IF($L54=0,\"\",IF($L54>0,CHAR(233),CHAR(234)))","v":""},null,{"$f":"$F$55","v":0},null,"check:",{"$f":"IF(OR($D$22=\"\",$B$25=\"\",$N$52=\"\"),\"\",IF($D$22=\"No\",\"use CD stem\",IF(AND($D$22=\"Yes\",$N$52=\"Exposed in stream\"),\"use CD RW\",\"use CD stem\")))","v":""},null,null,null,null,null,null,null,null,null,null,null,null,null,null,null,null,null,null,null,9,0,"None",0,0,0,0,false,0,0,0,"","",0,0,0,0,0,0,0,0,0,0,0,0,"","","","","","","",0,0,0,"",""]
["Total",{"$f":"$B$52+$B$53+$B$54","v":0},{"$f":"$C$52+$C$53+$C$54","v":0},{"$f":"$D$52+$D$53+$D$54","v":0},{"$f":"$E$52+$E$53+$E$54","v":0},{"$f":"$F$53+$F$54+$F$52","v":0},null,"FL (lbf)",{"$f":"$I$52","v":0},"",null,{"$f":"$I$52","v":0},null,"CDi for Stem Only (i.e., RW is not in contact with streamflow)",null,null,null,null,"Coordinates of Large Wood Bottom at Key Points",null,null,null,null,null,null,null,null,null,null,null,null,null,null,null,10,0,"None",0,0,0,0,false,0,0,0,"","",0,0,0,0,0,0,0,0,0,0,0,0,"","","","","","","",0,0,0,"",""]
[null,null,null,null,null,null,null,"WT (lbf)",{"$f":"$E$55","v":0},"",null,{"$f":"-$E$55","v":0},null,"Adjusted q (deg)","CDi Stem only1",null,null,null,null,"Wood Present?","Large Wood Parameters",null,null,null,"Soil",null,null,null,null,null,null,null,null,null,11,0,"None",0,0,0,0,false,0,0,0,"","",0,0,0,0,0,0,0,0,0,0,0,0,"","","","","","","",0,0,0,"",""]
["Soil Ballast Force",null,null,null,null,null,null,"Fsoil (lbf)",{"$f":"$E$61","v":0},"",null,{"$f":"-$E$61","v":0},null,{"$f":"IF(OR($O$54=\"\",$O$54=\"use CD RW\"),\"\",IF($B$25<-180,\"Error\",IF($B$25<-90,$B$25+180,IF($B$25<0,-$B$25,IF($B$25<=90,$B$25,IF($B$25<=180,180-$B$25,IF($B$25<=270,$B$25-180,IF($B$25<=360,360-$B$25,\"Error\"))))))))","v":""},{"$f":"IF($O$54=\"use CD stem\",(1.1173-((5.28*10^-2)*$N$57)+((1.4385*10^-3)*$N$57^2)-((9.7668*10^-6)*$N$57^3)),\"\")","v":""},null,null,null,null,null,"xTS (ft)","Dist (ft)","Adjusted Dist (ft)","yTS (ft)","ysoil (ft)",null,null,null,null,null,null,null,null,null,12,0,"None",0,0,0,0,false,0,0,0,"","",0,0,0,0,0,0,0,0,0,0,0,0,"","","","","","","",0,0,0,"",""]
["Soil","Vdry (ft3)","Vsat (ft3)","Vsoil (ft3)","Fsoil (lbf)",null,null,"FW,V (lbf)",{"$f":"ABS($L$99)","v":0},{"$f":"IF($L58=0,\"\",IF($L58>0,CHAR(233),CHAR(234)))","v":""},null,{"$f":"$L$99","v":0},"Flex","1Use Gippel et al (1996) Formula:",null,null,null,null,"At Left Bank Top",{"$f":"IF(OR($F$25=\"\",$G$25=\"\"),\"No\",IF(MIN($U$40:$U$41)>$B$14,\"No\",IF(MAX($U$40:$U$41)<$B$14,\"No\",\"Yes\")))","v":"No"},{"$f":"$B$14","v":0},{"$f":"IF(OR($B$25=0,$B$25=180,$B$25=360),0,IF($T$14>$T$13,$G$22+((($T$14-$B$14)/ABS($M$17))/$M$19),(($T$13-$B$14)/ABS($M$17))/$M$19))","v":0},{"$f":"IF(V58<0,0,IF(V58>$E$22,$E$22,V58))","v":0},{"$f":"IF($T$14>$T$13,$U$14+(($V$58-$G$22)*$M$20),$U$13-($V$58*$M$20))","v":0},{"$f":"$C$14","v":0},null,null,null,null,null,null,null,null,null,13,0,"None",0,0,0,0,false,0,0,0,"","",0,0,0,0,0,0,0,0,0,0,0,0,"","","","","","","",0,0,0,"",""]
["Bed",{"$f":"IF(AND($H$28=\"\",$H$29=\"\"),0,$AZ$43)","v":0},{"$f":"IF(AND($H$28=\"\",$H$29=\"\"),0,$BA$43)","v":0},{"$f":"B59+C59","v":0},{"$f":"IF(OR($D$28=\"\",$E$28=\"\"),0,($B$59*$D$28)+($C$59*$E$28))","v":0},null,null,"FA,V (lbf)",{"$f":"ABS($L$59)+ABS($M$59)","v":0},{"$f":"IF(($L59+M59)=0,\"\",IF(($L59+M59)>0,CHAR(233),CHAR(234)))","v":""},null,{"$f":"$L$86","v":0},{"$f":"$L$92","v":0},"CDi = 1.1173 - (5.2800*10-2) q + (1.4385*10-3) q2 - (9.7668*10-6) q3",null,null,null,null,"At Left Bank Toe",{"$f":"IF(OR($F$25=\"\",$G$25=\"\"),\"No\",IF(MIN($U$40:$U$41)>$B$15,\"No\",IF(MAX($U$40:$U$41)<$B$15,\"No\",\"Yes\")))","v":"No"},{"$f":"$B$15","v":0},{"$f":"IF(OR($B$25=0,$B$25=180,$B$25=360),0,IF($T$14>$T$13,$G$22+((($T$14-$B$15)/ABS($M$17))/$M$19),(($T$13-$B$15)/ABS($M$17))/$M$19))","v":0},0,{"$f":"IF($T$14>$T$13,$U$14+(($V$59-$G$22)*$M$20),$U$13-($V$59*$M$20))","v":0},{"$f":"$C$15","v":0},null,null,null,null,null,null,null,null,null,14,0,"None",0,0,0,0,false,0,0,0,"","",0,0,0,0,0,0,0,0,0,0,0,0,"","","","","","","",0,0,0,"",""]
["Bank",{"$f":"IF(AND($H$28=\"\",$H$29=\"\"),0,$BB$43)","v":0},{"$f":"IF(AND($H$28=\"\",$H$29=\"\"),0,$BC$43)","v":0},{"$f":"B60+C60","v":0},{"$f":"IF(OR($D$29=\"\",$E$29=\"\"),0,($B$60*$D$29)+($C$60*$E$29))","v":0},null,null,"S FV (lbf)",{"$f":"ABS($L$60)","v":0},"","Additional resisting force (lbf) needed:",{"$f":"$L$54+$L$55+$L$56+$L$57+$L$58+$L$59+$M$59","v":0},null,null,null,null,null,null,"At Left Thalweg",{"$f":"IF(OR($F$25=\"\",$G$25=\"\"),\"No\",IF(AND(MAX($U$40:$U$41)>$B$16,MIN($U$40:$U$41)<$B$16),\"Yes\",\"No\"))","v":"No"},{"$f":"$B$16","v":0},{"$f":"IF(OR($B$25=0,$B$25=180,$B$25=360),0,IF($T$14>$T$13,$G$22+((($T$14-$B$16)/ABS($M$17))/$M$19),(($T$13-$B$16)/ABS($M$17))/$M$19))","v":0},0,{"$f":"IF($T$14>$T$13,$U$14+(($V$60-$G$22)*$M$20),$U$13-($V$60*$M$20))","v":0},{"$f":"$C$16","v":0},null,null,null,null,null,null,null,null,null,15,0,"None",0,0,0,0,false,0,0,0,"","",0,0,0,0,0,0,0,0,0,0,0,0,"","","","","","","",0,0,0,"",""]
["Total",{"$f":"$B$59+$B$60","v":0},{"$f":"$C$59+$C$60","v":0},{"$f":"$D$59+$D$60","v":0},{"$f":"$E$59+$E$60","v":0},null,null,"FSV",{"$f":"IF(OR($E$22=\"\",$F$22=\"\",$F$25=\"\",$G$25=\"\"),0,IF($L$58>=0,($I$56+$I$57+$I$59)/($I$54+$I$55+$I$58),($I$56+$I$57+$I$58+$I$59)/($I$54+$I$55)))","v":0},{"$f":"$I$61-$L$61","v":-1.5},{"$f":"IF(AND($F$25=\"\",$G$25=\"\"),\"\",IF($I$61>=$L$61,\"Structure is Vertically Stable\",IF(AND($I$61<$L$61,$L$58>=0),$L$61*($L$54+$L$55+$L$58)-(-$L$56-$L$57-$L$59-$M$59),IF(AND($I$61<$L$61,$L$58<0),$L$61*($L$54+$L$55)-(-$L$56-$L$57-$L$59-$M$59-$L$58),\"\"))))","v":""},{"$f":"'2-Constants'!$C$5","v":1.5},null,"CD Stem with Exposed RW Lookup Table",null,null,null,null,"At Right Thalweg",{"$f":"IF(OR($F$25=\"\",$G$25=\"\"),\"No\",IF(AND(MAX($U$40:$U$41)>$B$16,MIN($U$40:$U$41)<$B$16),\"Yes\",\"No\"))","v":"No"},{"$f":"$B$16","v":0},{"$f":"IF(OR($B$25=0,$B$25=180,$B$25=360),0,IF($T$14<$T$13,$G$22+((($B$16-$T$14)/ABS($M$17))/$M$19),(($B$16-$T$13)/ABS($M$17))/$M$19))","v":0},0,{"$f":"IF($T$14<$T$13,$U$14+(($V$61-$G$22)*$M$20),$U$13-($V$61*$M$20))","v":0},{"$f":"$C$16","v":0},null,null,null,null,null,null,null,null,null,16,0,"None",0,0,0,0,false,0,0,0,"","",0,0,0,0,0,0,0,0,0,0,0,0,"","","","","","","",0,0,0,"",""]
[null,null,null,null,null,null,null,null,null,null,{"$f":"IF($K$61<>\"Structure is Vertically Stable\",\"\",IF($K$61=\"Structure is Vertically Stable\",IF($L$58>=0,($I$56+$I$57+$I$59)-(($I$58+$I$54+$I$55)*$L$61),($I$56+$I$57+$I$58+$I$59)-(($I$54+$I$55)*$L$61))))","v":""},null,null,"Adjusted q (deg)","CDi Stem + RW",null,null,null,"At Right Bank Toe",{"$f":"IF(OR($F$25=\"\",$G$25=\"\"),\"No\",IF(MAX($U$40:$U$41)<$B$17,\"No\",IF(MIN($U$40:$U$41)>$B$17,\"No\",\"Yes\")))","v":"No"},{"$f":"$B$17","v":0},{"$f":"IF(OR($B$25=0,$B$25=180,$B$25=360),0,IF($T$14<$T$13,$G$22+((($B$17-$T$14)/ABS($M$17))/$M$19),(($B$17-$T$13)/ABS($M$17))/$M$19))","v":0},0,{"$f":"IF($T$14<$T$13,$U$14+(($V$62-$G$22)*$M$20),$U$13-($V$62*$M$20))","v":0},{"$f":"$C$17","v":0},null,null,null,null,null,null,null,null,null,17,0,"None",0,0,0,0,false,0,0,0,"","",0,0,0,0,0,0,0,0,0,0,0,0,"","","","","","","",0,0,0,"",""]
["Horizontal Force Analysis",null,null,null,null,null,null,null,null,null,null,null,null,{"$f":"IF(OR($O$54=\"\",$O$54=\"use CD stem\"),\"\",IF(OR($B$25<-180,$B$25>360),\"Error\",IF($B$25>180,360-$B$25,IF($B$25<0,-$B$25,$B$25))))","v":""},{"$f":"IF(OR($O$54=\"\",$O$54=\"use CD stem\"),\"\",IF($B$25<22.5,(($B$25/22.5)*($O$67-$O$66)+$O$66),IF($B$25<45,((($B$25-$N$67)/22.5)*($O$68-$O$67)+$O$67),IF($B$25<67.5,((($B$25-$N$68)/22.5)*($O$69-$O$68)+$O$68),IF($B$25<90,((($B$25-$N$69)/22.5)*($O$70-$O$69)+$O$69),IF($B$25<112.5,((($B$25-$N$70)/22.5)*($O$71-$O$70)+$O$70),IF($B$25<135,((($B$25-$N$71)/22.5)*($O$72-$O$71)+$O$71),IF($B$25<157.5,((($B$25-$N$72)/22.5)*($O$73-$O$72)+$O$72),IF($B$25<=180,((($B$25-$N$74)/22.5)*($O$74-$O$73)+$O$74),$O$74)))))))))","v":""},null,null,null,"At Right Bank Top",{"$f":"IF(OR($F$25=\"\",$G$25=\"\"),\"No\",IF(MAX($U$40:$U$41)<$B$18,\"No\",IF(MIN($U$40:$U$41)>$B$18,\"No\",\"Yes\")))","v":"No"},{"$f":"$B$18","v":0},{"$f":"IF(OR($B$25=0,$B$25=180,$B$25=360),0,IF($T$14<$T$13,$G$22+((($B$18-$T$14)/ABS($M$17))/$M$19),(($B$18-$T$13)/ABS($M$17))/$M$19))","v":0},0,{"$f":"IF($T$14<$T$13,$U$14+(($V$63-$G$22)*$M$20),$U$13-($V$63*$M$20))","v":0},{"$f":"$C$18","v":0},null,null,null,null,null,null,null,null,null,18,0,"None",0,0,0,0,false,0,0,0,"","",0,0,0,0,0,0,0,0,0,0,0,0,"","","","","","","",0,0,0,"",""]
["Drag Force",null,null,null,null,null,null,null,null,null,null,null,null,null,null,null,null,null,null,null,null,null,null,null,null,null,null,null,null,null,null,null,null,null,19,0,"None",0,0,0,0,false,0,0,0,"","",0,0,0,0,0,0,0,0,0,0,0,0,"","","","","","","",0,0,0,"",""]
["ATp / AW","FrL","CDi","Cw","CD*","FD (lbf)",null,"Horizontal Force Balance",null,null,null,"Formatting",null,"q (deg)","CDi Stem + RW",null,null,null,null,null,null,"Log Bottom and Soil Intercept",null,"Dist to Intercept","Intercept in Zone?","LW Buried?","Exposed Segment",null,null,null,null,null,null,null,20,0,"None",0,0,0,0,false,0,0,0,"","",0,0,0,0,0,0,0,0,0,0,0,0,"","","","","","","",0,0,0,"",""]
[{"$f":"IF(OR($A$6=\"\",$F$6=\"\"),0,$J$25/(VLOOKUP($A$6,SiteInfo,7,0)))","v":0},{"$f":"IF($A$6=\"\",0,$J$6/(($F$22*g)^0.5))","v":0},{"$f":"IF($O$54=\"\",0,IF($O$54=\"use CD stem\",$O$57,$O$63))","v":0},{"$f":"IF(OR($BM$43=\"\",$B$25=\"\"),0,IF($BN$43>0.43,0.43,$BN$43))","v":0},{"$f":"IF(OR($F$22=\"\",$B$25=\"\"),0,0.997*($C$66+$D$66)*((1-$A$66)^-2.06))","v":0},{"$f":"IF(OR($E$66=\"\",$J$25=\"\"),0,$E$66*$J$25*SWWater*($J$6^2)/(2*g))","v":0},null,"FD (lbf)",{"$f":"IF(AND($F$66=0,$I$71>0),0.4999,$F$66)","v":0},{"$f":"IF($L$66=0,\"\",IF($L66>0,CHAR(232),CHAR(231)))","v":""},{"$f":"IF(AND($F$66=0,$I$71>0),\"NOTE - Tool has assumed the drag force = 0.49 lbf for FS calcs\",\"\")","v":""},{"$f":"$F$66","v":0},null,0,1.2,null,null,null,null,"Zone L (ft)","Log L (ft)","xbottom (ft)","ybottom (ft)",null,null,null,null,"Lem,bot (ft)",null,null,null,null,null,null,21,0,"None",0,0,0,0,false,0,0,0,"","",0,0,0,0,0,0,0,0,0,0,0,0,"","","","","","","",0,0,0,"",""]
[null,null,null,null,null,null,null,"FP (lbf)",{"$f":"$C$72","v":0},{"$f":"IF($L$67=0,\"\",IF($L67>=0,CHAR(232),CHAR(231)))","v":""},{"$f":"IF(OR($M$59=0,$M$70=0),\"\",\"NOTE -- Mechanical soil anchors and deadman boulders provide equal resistance to vertical and horizontal forces.  The model first applies these anchor forces to resist the vertical forces, and then applies the balance to resist the horizontal forces.\")","v":""},{"$f":"-$C$72","v":0},null,22.5,1.25,null,null,null,"LB Floodplain",{"$f":"($B$14-$B$13)/ABS($M$17)/ABS($M$19)","v":{"$error":"#DIV/0!"}},{"$f":"IF(MAX($U$40:$U$41)<=$B$14,$E$22,IF($T$58=\"No\",0,$E$22-$W$58))","v":0},{"$f":"IF($U$67=0,0,IF(OR($B$25=0,$B$25=180,$B$25=360),$U$40,$U$58+(($X$58-$C$14)/($AB$31-$AA$40))))","v":0},{"$f":"IF($U$67=0,0,IF(OR($B$25=0,$B$25=180,$B$25=360),(($U$40-$B$13)*$AB$31)+$C$13,$X$58+(($V$67-$U$58)*$AA$40)))","v":0},{"$f":"IF($U$67=0,0,IF(OR($B$25=0,$B$25=180,$B$25=360),$E$22-ABS(($X$41-$W$67)/$M$20),IF(AND($U$40<=$U$41,$X$40>=$Y$40),ABS(($X$40-$W$67)/($AA$40*$M$17*$M$19)),IF(AND($U$40<=$U$41,$X$40<$Y$40),ABS($E$22-(ABS(($X$40-$W$67)/($AA$40*$M$17*$M$19)))),IF(AND($U$40>$U$41,$X$41>=$Y$41),ABS(($X$41-$W$67)/($AA$40*$M$17*$M$19)),IF(AND($U$40>=$U$41,$X$41<$Y$41),ABS($E$22-(ABS(($X$40-$W$67)/($AA$40*$M$17*$M$19))))))))))","v":0},{"$f":"IF(AND($U$67=0,$W$67=0),\"No\",IF(AND($V$67<=$B$14,$V$67>=$B$13,$V$67>=MIN($U$40:$U$41),$V$67<=MAX($U$40:$U$41),$W$67<$C$13,$X$67<=$E$22),\"Yes\",\"No\"))","v":"No"},{"$f":"IF($U$67=0,\"No\",IF($Y$67=\"Yes\",\"Partial\",IF(AND($U$67<$E$22,$X$41<$Y$41,$Y$67=\"No\",$Y$68=\"No\",$Y$69=\"No\",$Y$70=\"No\",$Y$71=\"No\",$Y$72=\"No\"),\"Yes\",IF(AND($Y$67=\"No\",$X$58>$Y$58),\"No\",\"Yes\"))))","v":"No"},{"$f":"IF($Z$67=\"Yes\",\"None\",IF(AND($Z$67=\"No\",$U$67=0),\"None\",IF($Z$67=\"No\",\"All\",IF(AND($X$41>=$Y$41,$U$41<=$U$40),\"Left\",\"Right\"))))","v":"None"},{"$f":"IF($U$67=0,0,IF($Z$67=\"No\",0,IF($Z$67=\"Yes\",$U$67,IF(OR($AA$67=\"Left\",$U$67=$E$22),$U$67-(ABS(($U$41-$V$67)/($M$17*$M$19))),$U$67-(ABS(($V$67-$B$14)/($M$17*$M$19)))))))","v":0},null,null,null,null,null,null,22,0,"None",0,0,0,0,false,0,0,0,"","",0,0,0,0,0,0,0,0,0,0,0,0,"","","","","","","",0,0,0,"",""]
["Passive Soil Pressure",null,null,"Friction Force",null,null,null,"FF (lbf)",{"$f":"$F$72","v":0},{"$f":"IF($L$68=0,\"\",IF($L68>=0,CHAR(232),CHAR(231)))","v":""},null,{"$f":"-$F$72","v":0},null,45,1.1200000000000001,null,null,null,"Left Bank",{"$f":"($B$15-$B$14)/ABS($M$17)/ABS($M$19)","v":{"$error":"#DIV/0!"}},{"$f":"IF(AND(MIN($U$40:$U$41)>=$B$14,MAX($U$40:$U$41)<=$B$15),$E$22,IF(AND($T$59=\"No\",$T$58=\"No\"),0,$E$22-$W$59-$U$67))","v":0},{"$f":"IF($U$68=0,0,IF(OR($B$25=0,$B$25=180,$B$25=360),$U$40,$U$59+(($C$15-$X$59)/($AA$40-$AB$32))))","v":0},{"$f":"IF($U$68=0,0,IF(OR($B$25=0,$B$25=180,$B$25=360),(($U$40-$B$14)*$AB$32)+$C$14,$X$59+(($V$68-$U$59)*$AA$40)))","v":0},{"$f":"IF($U$68=0,0,IF(OR($B$25=0,$B$25=180,$B$25=360),$E$22-ABS(($X$41-$W$68)/$M$20),IF(AND($U$40<=$U$41,$X$40>=$Y$40),ABS(($X$40-$W$68)/($AA$40*$M$17*$M$19)),IF(AND($U$40<=$U$41,$X$40<$Y$40),ABS($E$22-(ABS(($X$40-$W$68)/($AA$40*$M$17*$M$19)))),IF(AND($U$40>$U$41,$X$41>=$Y$41),ABS(($X$41-$W$68)/($AA$40*$M$17*$M$19)),IF(AND($U$40>=$U$41,$X$41<$Y$41),ABS($E$22-(ABS(($X$40-$W$68)/($AA$40*$M$17*$M$19))))))))))","v":0},{"$f":"IF(AND($U$68=0,$W$68=0),\"No\",IF(AND($V$68<=$B$15,$V$68>=$B$14,$V$68>=MIN($U$40:$U$41),$V$68<=MAX($U$40:$U$41),$W$68<$C$14,$X$68<=$E$22),\"Yes\",\"No\"))","v":"No"},{"$f":"IF($U$68=0,\"No\",IF($Y$68=\"Yes\",\"Partial\",IF(AND($U$68<$E$22,$X$41<$Y$41,$Y$67=\"No\",$Y$68=\"No\",$Y$69=\"No\",$Y$70=\"No\",$Y$71=\"No\",$Y$72=\"No\"),\"Yes\",IF(AND($Y$68=\"No\",$X$59>$Y$59),\"No\",\"Yes\"))))","v":"No"},{"$f":"IF($Z$68=\"Yes\",\"None\",IF(AND($Z$68=\"No\",$U$68=0),\"None\",IF($Z$68=\"No\",\"All\",IF(AND($X$41>=$Y$41,$U$41<=$U$40,$AA$67<>\"Left\"),\"Left\",\"Right\"))))","v":"None"},{"$f":"IF($U$68=0,0,IF($Z$68=\"No\",0,IF($Z$68=\"Yes\",$U$68,IF(OR($U$68=$E$22,AND($AA$68=\"Left\",MIN($U$40:$U$41)>=$B$14,MAX($U$40:$U$41)>=$B$15)),$U$68-(ABS(($U$41-$V$68)/($M$17*$M$19))),IF($AA$68=\"Left\",$U$68-(ABS(($B$14-$V$68)/($M$17*$M$19))),IF(MAX($U$40:$U$41)>=$B$15,$U$68-(ABS(($V$68-$B$15)/($M$17*$M$19))),ABS(($V$68-$B$14)/($M$17*$M$19))))))))","v":0},null,null,null,null,null,null,23,0,"None",0,0,0,0,false,0,0,0,"","",0,0,0,0,0,0,0,0,0,0,0,0,"","","","","","","",0,0,0,"",""]
["Soil","KP","FP (lbf)","LTf (ft)","m","FF (lbf)",null,"FW,H (lbf)",{"$f":"ABS($M$99)","v":0},{"$f":"IF($L$69=0,\"\",IF($L69>=0,CHAR(232),CHAR(231)))","v":""},null,{"$f":"$M$99","v":0},"Flex",67.5,1.22,null,null,null,"Left Stream Bed",{"$f":"($B$16-$B$15)/ABS($M$17)/ABS($M$19)","v":{"$error":"#DIV/0!"}},{"$f":"IF(AND(MIN($U$40:$U$41)>=$B$15,MAX($U$40:$U$41)<=$B$16),$E$22,IF(AND($T$60=\"No\",$T$59=\"No\"),0,IF(AND($T$59=\"Yes\",$T$60=\"No\"),$E$22-$U$68-$U$67,IF(AND($T$59=\"Yes\",$T$60=\"Yes\",$T$62=\"No\"),$E$22-$U$70-$U$68-$U$67,IF(AND($T$59=\"Yes\",$T$60=\"Yes\",$T$62=\"Yes\"),$E$22-$U$72-$U$71-$U$70-$U$68-$U$67,$E$22-$U$72-$U$71-$U$70)))))","v":0},{"$f":"IF($U$69=0,0,IF(OR($B$25=0,$B$25=180,$B$25=360),$U$40,$U$60+(($C$16-$X$60)/($AA$40-$AB$33))))","v":0},{"$f":"IF($U$69=0,0,IF(OR($B$25=0,$B$25=180,$B$25=360),(($U$40-$B$15)*$AB$33)+$C$15,$X$60+(($V$69-$U$60)*$AA$40)))","v":0},{"$f":"IF($U$69=0,0,IF(OR($B$25=0,$B$25=180,$B$25=360),$E$22-ABS(($X$41-$W$69)/$M$20),IF(AND($U$40<=$U$41,$X$40>=$Y$40),ABS(($X$40-$W$69)/($AA$40*$M$17*$M$19)),IF(AND($U$40<=$U$41,$X$40<$Y$40),ABS($E$22-(ABS(($X$40-$W$69)/($AA$40*$M$17*$M$19)))),IF(AND($U$40>$U$41,$X$41>=$Y$41),ABS(($X$41-$W$69)/($AA$40*$M$17*$M$19)),IF(AND($U$40>=$U$41,$X$41<$Y$41),ABS($E$22-(ABS(($X$40-$W$69)/($AA$40*$M$17*$M$19))))))))))","v":0},{"$f":"IF(AND($U$69=0,$W$69=0),\"No\",IF(AND($V$69<=$B$16,$V$69>=$B$15,$V$69>=MIN($U$40:$U$41),$V$69<=MAX($U$40:$U$41),$W$69<$C$15,$X$69<=$E$22),\"Yes\",\"No\"))","v":"No"},{"$f":"IF($U$69=0,\"No\",IF($Y$69=\"Yes\",\"Partial\",IF(AND($U$69<$E$22,$X$41<$Y$41,$Y$67=\"No\",$Y$68=\"No\",$Y$69=\"No\",$Y$70=\"No\",$Y$71=\"No\",$Y$72=\"No\"),\"Yes\",IF(AND($Y$69=\"No\",$X$60>$Y$60),\"No\",\"Yes\"))))","v":"No"},{"$f":"IF($Z$69=\"Yes\",\"None\",IF(AND($Z$69=\"No\",$U$69=0),\"None\",IF($Z$69=\"No\",\"All\",IF(AND($X$41>=$Y$41,$U$41<=$U$40,$AA$68<>\"Left\"),\"Left\",\"Right\"))))","v":"None"},{"$f":"IF($U$69=0,0,IF($Z$69=\"No\",0,IF($Z$69=\"Yes\",$U$69,IF(OR($U$69=$E$22,AND($AA$69=\"Left\",MIN($U$40:$U$41)>=$B$15,MAX($U$40:$U$41)>=$B$16)),$U$69-(ABS(($U$41-$V$69)/($M$17*$M$19))),IF($AA$69=\"Left\",$U$69-(ABS(($B$15-$V$69)/($M$17*$M$19))),IF(MAX($U$40:$U$41)>=$B$16,$U$69-(ABS(($V$69-$B$16)/($M$17*$M$19))),ABS(($V$69-$B$15)/($M$17*$M$19))))))))","v":0},null,null,null,null,null,null,24,0,"None",0,0,0,0,false,0,0,0,"","",0,0,0,0,0,0,0,0,0,0,0,0,"","","","","","","",0,0,0,"",""]
["Bed",{"$f":"IF(OR($A$6=\"\",$F$6=\"\",$F$25=\"\"),0,TAN((45+($F$28/2))*PI()/180)^2)","v":0},{"$f":"IF($E$61=0,0,0.5*$B$70*$E$59)","v":0},{"$f":"IF($F$28=\"\",0,IF($U$15<$AF$47,$BP$43+2,$BP$43))","v":0},{"$f":"IF($F$28=\"\",0,TAN($F$28*PI()/180))","v":0},{"$f":"IF(OR($L$60>=0,$D$70=0),0,$I$60*$E$70*($D$70/$D$72))","v":0},null,"FA,H (lbf)",{"$f":"ABS($L$70)+ABS($M$70)","v":0},{"$f":"IF(($L$70+M70)=0,\"\",IF(($L$70+M70)>=0,CHAR(232),CHAR(231)))","v":""},null,{"$f":"$M$86","v":0},{"$f":"$M$92","v":0},90,0.97,null,null,null,"Right Stream Bed",{"$f":"($B$17-$B$16)/ABS($M$17)/ABS($M$19)","v":{"$error":"#DIV/0!"}},{"$f":"IF(AND(MIN($U$40:$U$41)>=$B$16,MAX($U$40:$U$41)<=$B$17),$E$22,IF(AND($T$61=\"No\",$T$62=\"No\"),0,IF(AND($T$62=\"Yes\",$T$61=\"No\"),$E$22-$U$71-$U$72,IF(AND($T$62=\"Yes\",$T$61=\"Yes\"),$E$22-$W$61-$U$71-$U$72,$E$22-$W$61))))","v":0},{"$f":"IF($U$70=0,0,IF(OR($B$25=0,$B$25=180,$B$25=360),$U$40,$U$61+(($X$61-$C$16)/($AB$34-$AA$40))))","v":0},{"$f":"IF($U$70=0,0,IF(OR($B$25=0,$B$25=180,$B$25=360),(($U$40-$B$16)*$AB$34)+$C$16,$X$61+(($V$70-$U$61)*$AA$40)))","v":0},{"$f":"IF($U$70=0,0,IF(OR($B$25=0,$B$25=180,$B$25=360),$E$22-ABS(($X$41-$W$70)/$M$20),IF(AND($U$40<=$U$41,$X$40>=$Y$40),ABS(($X$40-$W$70)/($AA$40*$M$17*$M$19)),IF(AND($U$40<=$U$41,$X$40<$Y$40),ABS($E$22-(ABS(($X$40-$W$70)/($AA$40*$M$17*$M$19)))),IF(AND($U$40>$U$41,$X$41>=$Y$41),ABS(($X$41-$W$70)/($AA$40*$M$17*$M$19)),IF(AND($U$40>=$U$41,$X$41<$Y$41),ABS($E$22-(ABS(($X$40-$W$70)/($AA$40*$M$17*$M$19))))))))))","v":0},{"$f":"IF(AND($U$70=0,$W$70=0),\"No\",IF(AND($V$70<=$B$17,$V$70>=$B$16,$V$70>=MIN($U$40:$U$41),$V$70<=MAX($U$40:$U$41),$W$70<$C$17,$X$70<=$E$22),\"Yes\",\"No\"))","v":"No"},{"$f":"IF($U$70=0,\"No\",IF($Y$70=\"Yes\",\"Partial\",IF(AND($U$70<$E$22,$X$41<$Y$41,$Y$67=\"No\",$Y$68=\"No\",$Y$69=\"No\",$Y$70=\"No\",$Y$71=\"No\",$Y$72=\"No\"),\"Yes\",IF(AND($Y$70=\"No\",$X$61>$Y$61),\"No\",\"Yes\"))))","v":"No"},{"$f":"IF($Z$70=\"Yes\",\"None\",IF(AND($Z$70=\"No\",$U$70=0),\"None\",IF($Z$70=\"No\",\"All\",IF(AND($X$41>=$Y$41,$U$41>=$U$40,$AA$71<>\"Right\"),\"Right\",\"Left\"))))","v":"None"},{"$f":"IF($U$70=0,0,IF($Z$70=\"No\",0,IF($Z$70=\"Yes\",$U$70,IF(OR($U$70=$E$22,AND($AA$70=\"Right\",MIN($U$40:$U$41)<=$B$16,MAX($U$40:$U$41)<=$B$17)),$U$70-(ABS(($U$41-$V$70)/($M$17*$M$19))),IF($AA$70=\"Right\",$U$70-(ABS(($B$17-$V$70)/($M$17*$M$19))),IF(MIN($U$40:$U$41)<=$B$16,$U$70-(ABS(($V$70-$B$16)/($M$17*$M$19))),ABS(($V$70-$B$17)/($M$17*$M$19))))))))","v":0},null,null,null,null,null,null,25,0,"None",0,0,0,0,false,0,0,0,"","",0,0,0,0,0,0,0,0,0,0,0,0,"","","","","","","",0,0,0,"",""]
["Bank",{"$f":"IF(OR($A$6=\"\",$F$6=\"\",$F$25=\"\"),0,TAN((45+($F$29/2))*PI()/180)^2)","v":0},{"$f":"IF($E$61=0,0,0.5*$B$71*$E$60)","v":0},{"$f":"IF($F$28=\"\",0,$BQ$43)","v":0},{"$f":"IF($F$28=\"\",0,TAN($F$29*PI()/180))","v":0},{"$f":"IF(OR($L$60>=0,$D$71=0),0,$I$60*$E$71*($D$71/$D$72))","v":0},null,"S FH (lbf)",{"$f":"ABS($L$71)","v":0},{"$f":"IF($L$71=0,\"\",IF($L71>=0,CHAR(232),CHAR(231)))","v":""},"Additional resisting force (lbf) needed:",{"$f":"$L$66+$L$67+$L$68+$L$69+$L$70+$M$70","v":0},null,112.5,1,null,null,null,"Right Bank",{"$f":"($B$18-$B$17)/ABS($M$17)/ABS($M$19)","v":{"$error":"#DIV/0!"}},{"$f":"IF(AND(MIN($U$40:$U$41)>=$B$17,MAX($U$40:$U$41)<=$B$18),$E$22,IF(AND($T$62=\"No\",$T$63=\"No\"),0,$E$22-$W$62-$U$72))","v":0},{"$f":"IF($U$71=0,0,IF(OR($B$25=0,$B$25=180,$B$25=360),$U$40,$U$62+(($X$62-$C$17)/($AB$35-$AA$40))))","v":0},{"$f":"IF($U$71=0,0,IF(OR($B$25=0,$B$25=180,$B$25=360),(($U$40-$B$17)*$AB$35)+$C$17,$X$62+(($V$71-$U$62)*$AA$40)))","v":0},{"$f":"IF($U$71=0,0,IF(OR($B$25=0,$B$25=180,$B$25=360),$E$22-ABS(($X$41-$W$71)/$M$20),IF(AND($U$40<=$U$41,$X$40>=$Y$40),ABS(($X$40-$W$71)/($AA$40*$M$17*$M$19)),IF(AND($U$40<=$U$41,$X$40<$Y$40),ABS($E$22-(ABS(($X$40-$W$71)/($AA$40*$M$17*$M$19)))),IF(AND($U$40>$U$41,$X$41>=$Y$41),ABS(($X$41-$W$71)/($AA$40*$M$17*$M$19)),IF(AND($U$40>=$U$41,$X$41<$Y$41),ABS($E$22-(ABS(($X$40-$W$71)/($AA$40*$M$17*$M$19))))))))))","v":0},{"$f":"IF(AND($U$71=0,$W$71=0),\"No\",IF(AND($V$71<=$B$18,$V$71>=$B$17,$V$71>=MIN($U$40:$U$41),$V$71<=MAX($U$40:$U$41),$W$71<$C$18,$X$71<=$E$22),\"Yes\",\"No\"))","v":"No"},{"$f":"IF($U$71=0,\"No\",IF($Y$71=\"Yes\",\"Partial\",IF(AND($U$71<$E$22,$X$41<$Y$41,$Y$67=\"No\",$Y$68=\"No\",$Y$69=\"No\",$Y$70=\"No\",$Y$71=\"No\",$Y$72=\"No\"),\"Yes\",IF(AND($Y$71=\"No\",$X$62>$Y$62),\"No\",\"Yes\"))))","v":"No"},{"$f":"IF($Z$71=\"Yes\",\"None\",IF(AND($Z$71=\"No\",$U$71=0),\"None\",IF($Z$71=\"No\",\"All\",IF(AND($X$41>=$Y$41,$U$41>=$U$40,$AA$72<>\"Right\"),\"Right\",\"Left\"))))","v":"None"},{"$f":"IF($U$71=0,0,IF($Z$71=\"No\",0,IF($Z$71=\"Yes\",$U$71,IF(OR($U$71=$E$22,AND($AA$71=\"Right\",MIN($U$40:$U$41)<=$B$17,MAX($U$40:$U$41)<=$B$18)),$U$71-(ABS(($U$41-$V$71)/($M$17*$M$19))),IF($AA$71=\"Right\",$U$71-(ABS(($B$18-$V$71)/($M$17*$M$19))),IF(MIN($U$40:$U$41)<=$B$17,$U$71-(ABS(($V$71-$B$17)/($M$17*$M$19))),ABS(($V$71-$B$18)/($M$17*$M$19))))))))","v":0},null,null,null,null,null,null,26,0,"None",0,0,0,0,false,0,0,0,"","",0,0,0,0,0,0,0,0,0,0,0,0,"","","","","","","",0,0,0,"",""]
["Total","-",{"$f":"$C$70+$C$71","v":0},{"$f":"$D$70+$D$71","v":0},"-",{"$f":"$F$70+$F$71","v":0},null,"FSH",{"$f":"IF(OR($E$22=\"\",$F$22=\"\",$F$25=\"\",$G$25=\"\"),0,IF($I$66=0,0,IF($L$69>=0,($I$67+$I$68+$I$70)/($I$66+$I$69),($I$67+$I$68+$I$69+$I$70)/$I$66)))","v":0},{"$f":"$I$72-$L$72","v":-2},{"$f":"IF(AND($F$25=\"\",$G$25=\"\"),\"\",IF(OR($J$25=0,$I$72>=$L$72),\"Structure is Horizontally Stable\",IF(AND($I$72<$L$72,$L$69>=0),$L$72*($L$66+$L$69)-(-$L$67-$L$68-$L$70-$M$70),IF(AND($I$72<$L$72,$L$69<0),$L$72*($L$66)-(-$L$67-$L$68-$L$70-$M$70-$L$69),\"\"))))","v":""},{"$f":"'2-Constants'!$C$6","v":2},null,135,0.81,null,null,null,"RB Floodplain",{"$f":"($B$19-$B$18)/ABS($M$17)/ABS($M$19)","v":{"$error":"#DIV/0!"}},{"$f":"IF(MIN($U$40:$U$41)>=$B$18,$E$22,IF($T$63=\"No\",0,$E$22-$W$63))","v":0},{"$f":"IF($U$72=0,0,IF(OR($B$25=0,$B$25=180,$B$25=360),$U$40,$U$63+(($X$63-$C$18)/($AB$36-$AA$40))))","v":0},{"$f":"IF($U$72=0,0,IF(OR($B$25=0,$B$25=180,$B$25=360),(($U$40-$B$18)*$AB$36)+$C$18,$X$63+(($V$72-$U$63)*$AA$40)))","v":0},{"$f":"IF($U$72=0,0,IF(OR($B$25=0,$B$25=180,$B$25=360),$E$22-ABS(($X$41-$W$72)/$M$20),IF(AND($U$40<=$U$41,$X$40>=$Y$40),ABS(($X$40-$W$72)/($AA$40*$M$17*$M$19)),IF(AND($U$40<=$U$41,$X$40<$Y$40),ABS($E$22-(ABS(($X$40-$W$72)/($AA$40*$M$17*$M$19)))),IF(AND($U$40>$U$41,$X$41>=$Y$41),ABS(($X$41-$W$72)/($AA$40*$M$17*$M$19)),IF(AND($U$40>=$U$41,$X$41<$Y$41),ABS($E$22-(ABS(($X$40-$W$72)/($AA$40*$M$17*$M$19))))))))))","v":0},{"$f":"IF(AND($U$72=0,$W$72=0),\"No\",IF(AND($V$72<=$B$19,$V$72>=$B$18,$V$72>=MIN($U$40:$U$41),$V$72<=MAX($U$40:$U$41),$W$72<$C$19,$X$72<=$E$22),\"Yes\",\"No\"))","v":"No"},{"$f":"IF($U$72=0,\"No\",IF($Y$72=\"Yes\",\"Partial\",IF(AND($U$72<$E$22,$X$41<$Y$41,$Y$67=\"No\",$Y$68=\"No\",$Y$69=\"No\",$Y$70=\"No\",$Y$71=\"No\",$Y$72=\"No\"),\"Yes\",IF(AND($Y$72=\"No\",$X$63>$Y$63),\"No\",\"Yes\"))))","v":"No"},{"$f":"IF($Z$72=\"Yes\",\"None\",IF(AND($Z$72=\"No\",$U$72=0),\"None\",IF($Z$72=\"No\",\"All\",IF(AND($X$41>=$Y$41,$U$41>=$U$40),\"Right\",\"Left\"))))","v":"None"},{"$f":"IF($U$72=0,0,IF($Z$72=\"No\",0,IF($Z$72=\"Yes\",$U$72,IF(OR($AA$72=\"Right\",$U$72=$E$22),$U$72-(ABS(($U$41-$V$72)/($M$17*$M$19))),$U$72-(ABS(($V$72-$B$18)/($M$17*$M$19)))))))","v":0},null,null,null,null,null,null,27,0,"None",0,0,0,0,false,0,0,0,"","",0,0,0,0,0,0,0,0,0,0,0,0,"","","","","","","",0,0,0,"",""]
[null,null,null,null,null,null,null,null,null,null,{"$f":"IF($K$72<>\"Structure is Horizontally Stable\",\"\",IF($K$72=\"Structure is Horizontally Stable\",IF($L$69>=0,($I$67+$I$68+$I$70)-(($I$69+$I$66)*$L$72),($I$67+$I$68+$I$69+$I$70)-(($I$66)*$L$72))))","v":""},null,null,157.5,0.75,null,null,null,null,"L check",{"$f":"SUM(U67:U72)","v":0},{"$f":"IF($U$53=$E$22,\"OK\",\"ERROR\")","v":"OK"},null,null,null,null,"Total",{"$f":"SUM(AB67:AB72)","v":0},null,null,null,null,null,null,28,0,"None",0,0,0,0,false,0,0,0,"","",0,0,0,0,0,0,0,0,0,0,0,0,"","","","","","","",0,0,0,"",""]
["Moment Force Balance",null,null,null,null,null,null,null,null,null,null,{"$f":"IF($D$22=\"Yes\",\"Rootwad\",\"Root Collar\")","v":"Root Collar"},null,180,1.1000000000000001,null,null,null,null,null,null,null,null,null,null,null,null,null,null,null,null,null,null,null,29,0,"None",0,0,0,0,false,0,0,0,"","",0,0,0,0,0,0,0,0,0,0,0,0,"","","","","","","",0,0,0,"",""]
["Driving Moment Centroids",null,null,"Resisting Moment Centroids",null,null,null,"Moment Force Balance",null,null,null,null,null,"Source:  Gippel (1992) plot of drag coefficients",null,null,null,null,"Projected Area of Log Calculation",null,null,null,"Projected Area of Rootwad Calculation",null,null,null,null,null,null,null,null,null,null,null,30,0,"None",0,0,0,0,false,0,0,0,"","",0,0,0,0,0,0,0,0,0,0,0,0,"","","","","","","",0,0,0,"",""]
["cT,B (ft)","cL (ft)","cD (ft)","cT,W (ft)","csoil (ft)","cF&N (ft)","cP (ft)","Md (lbf)",{"$f":"IF(OR($C$19=\"\",$E$22=\"\",$D$22=\"\",$F$22=\"\",$F$25=\"\",$G$25=\"\"),0,IF($F$78=\"Stem Tip\",$L$77,$L$78))","v":0},null,null,"Md","Mr",null,null,"Centroid of Log",null,null,"DTS =",{"$f":"IF(OR($E$22=\"\",$F$22=\"\",$F$25=\"\",$G$25=\"\"),\"\",$F$22)","v":""},"ft",null,null,"a = DRW/2",{"$f":"$H$22/2","v":0},"ft","A =","a*b*((p/2)+arcsin(d/a)) + (b*d*(sqrt(a2-d2))/a)",null,null,null,null,null,null,31,0,"None",0,0,0,0,false,0,0,0,"","",0,0,0,0,0,0,0,0,0,0,0,0,"","","","","","","",0,0,0,"",""]
[{"$f":"$Q$79","v":0},{"$f":"IF($I$52=0,0,IF($T$12>=$T$11,$E$22-$BL$43,$BL$43))","v":0},{"$f":"IF($F$66=0,0,IF($T$12>=$T$11,$E$22-$BI$43,$BI$43))","v":0},{"$f":"$Q$79","v":0},{"$f":"IF($E$61=0,0,IF($T$12>=$T$11,$E$22-$BS$43,$BS$43))","v":0},{"$f":"IF($F$72=0,0,IF($T$12>=$T$11,$E$22-$BR$43,$BR$43))","v":0},{"$f":"IF($C$72=0,0,IF($T$12>=$T$11,$E$22-$BT$39,$BT$39))","v":0},"Mr (lbf)",{"$f":"IF(OR($C$19=\"\",$E$22=\"\",$D$22=\"\",$F$22=\"\",$F$25=\"\",$G$25=\"\"),0,IF($F$78=\"Stem Tip\",$M$77,$M$78))","v":0},null,"Additional resisting moment force (lbf) needed:",{"$f":"(($I$54*$A$77)+($I$55*$B$77)+($I$66*$C$77)+(IF($L$95>0,$L$95*$D$95,0))+(IF($L$96>0,$L$96*$D$96,0))+(IF($L$97>0,$L$97*$D$97,0))+(IF($L$98>0,$L$98*$D$98,0))+(IF($M$95>0,$M$95*$D$95,0))+(IF($M$96>0,$M$96*$D$96,0))+(IF($M$97>0,$M$97*$D$97,0))+(IF($M$98>0,$M$98*$D$98,0)))*$M$19","v":0},{"$f":"(($I$56*$D$77)+(IF($L$60<0,$I$60*$F$77))+($I$57*$E$77)+($I$67*$G$77)+($I$68*$F$77)+(($D$83+$E$83)*$C$83)+($J$83*$H$83)+($J$84*$H$84)+(($I$87+$J$87)*$C$87)+(($I$88+$J$88)*$C$88)+(($I$89+$J$89)*$C$89)+(IF($L$95<=0,$G$95*$D$95,0))+(IF($L$96<=0,$G$96*$D$96,0))+(IF($L$97<=0,$G$97*$D$97,0))+(IF($L$98<=0,$G$98*$D$98,0))+(IF($M$95<=0,$I$95*$D$95,0))+(IF($M$96<=0,$I$96*$D$96,0))+(IF($M$97<=0,$I$97*$D$97,0))+(IF($M$98<=0,$I$98*$D$98,0)))*$M$19","v":0},"Stem Tip",null,"cRW",{"$f":"IF(OR($D$22=\"\",$D$22=\"No\",$F$22=\"\"),0,$E$22-((1/4)*$G$22*(($H$22^2)+(2*$H$22*$F$22)+(3*($F$22^2)))/(($H$22^2)+($H$22*$F$22)+($F$22^2))))","v":0},null,"ATSp,total =",{"$f":"IF($T$76=\"\",\"\",ABS(($U$42-$U$43)*$F$22/$M$19))","v":""},"ft2",null,null,"b= (DRW/2)*ABS(cos(q))",{"$f":"($H$22/2)*ABS(COS($B$25*PI()/180))","v":0},"ft","ARW,total =",{"$f":"IF(OR($D$22=\"\",$D$22=\"No\"),0,PI()*$Y$76*$Y$77)","v":0},"ft2",null,null,null,null,null,32,0,"None",0,0,0,0,false,0,0,0,"","",0,0,0,0,0,0,0,0,0,0,0,0,"","","","","","","",0,0,0,"",""]
["*Distances are from the stem tip",null,null,"Point of Rotation:",null,{"$f":"IF(OR($F$25=\"\",$G$25=\"\",$D$22=\"\"),\"\",IF(AND($T$11<$T$12,$AY$45>0),$L$74,IF(AND($T$11>$T$12,$AY$245>0),$L$74,IF(AND($AY$45>0,$AY$245>0),$L$74,IF(AND($AY$45=0,$AY$245=0),$L$74,\"Stem Tip\")))))","v":""},null,"FSM",{"$f":"IF(OR($E$22=\"\",$F$22=\"\",$F$25=\"\",$G$25=\"\"),0,IF(OR($A$6=\"\",$F$25=\"\",$G$25=\"\"),\"\",$I$77/$I$76))","v":0},{"$f":"$I$78-$L$80","v":-2},{"$f":"IF(AND($F$25=\"\",$G$25=\"\"),\"\",IF($I$78>=$L$80,\"Structure is Stable with respect to Moment Forces\",($I$76*$L$80)-$I$77))","v":""},{"$f":"(($I$54*($E$22-$A$77))+($I$55*($E$22-$B$77))+($I$66*($E$22-$C$77))+(IF($L$95>0,$L$95*($E$22-$D$95),0))+(IF($L$96>0,$L$96*($E$22-$D$96),0))+(IF($L$97>0,$L$97*($E$22-$D$97),0))+(IF($L$98>0,$L$98*($E$22-$D$98),0))+(IF($M$95>0,$M$95*($E$22-$D$95),0))+(IF($M$96>0,$M$96*($E$22-$D$96),0))+(IF($M$97>0,$M$97*($E$22-$D$97),0))+(IF($M$98>0,$M$98*($E$22-$D$98),0)))*$M$19","v":0},{"$f":"(($I$56*($E$22-$D$77))+(IF($L$60<0,$I$60*($E$22-$F$77)))+($I$57*($E$22-$E$77))+($I$67*($E$22-$G$77))+($I$68*($E$22-$F$77))+(($D$83+$E$83)*($E$22-$C$83))+($J$83*($E$22-$H$83))+($J$84*($E$22-$H$84))+(($I$87+$J$87)*($E$22-$C$87))+(($I$88+$J$88)*($E$22-$C$88))+(($I$89+$J$89)*($E$22-$C$89))+(IF($L$95<=0,$G$95*($E$22-$D$95),0))+(IF($L$96<=0,$G$96*($E$22-$D$96),0))+(IF($L$97<=0,$G$97*($E$22-$D$97),0))+(IF($L$98<=0,$G$98*($E$22-$D$98),0))+(IF($M$95<=0,$I$95*($E$22-$D$95),0))+(IF($M$96<=0,$I$96*($E$22-$D$96),0))+(IF($M$97<=0,$I$97*($E$22-$D$97),0))+(IF($M$98<=0,$I$98*($E$22-$D$98),0)))*$M$19","v":0},"Root Collar or RW",null,"cTS",{"$f":"(($E$22-$G$22)/2)","v":0},null,"ATSp,dry =",{"$f":"IF($T$86=\"\",\"\",IF($T$86=\"Submerged\",0,IF($T$88=\"Dry\",$T$77,IF(AND($AC$86=\"Dry\",$T$86=\"Partial\"),ABS(($U$43-$W$87)*$F$22/$M$19),IF(AND($AC$86=\"Partial\",$AC$87=\"Partial\"),(ABS($U$39-$U$38))*(($AF$86+$AF$87)/2),IF($AC$86=\"Partial\",(ABS($U$39-$W$86))*$AF$86/2,(($U$41-$W$88)*$F$22)+(ABS($W$88-$U$40))*($AF$87+$F$22)/2))))))","v":""},"ft2",null,null,"d1 = (DRW/2) - (yRW,crown-WSE)",{"$f":"IF(OR($D$22=\"\",$F$22=\"\"),\"\",IF($AE$8>=$U$10,$Y$76,$Y$76-($U$10-$AE$8)))","v":""},"ft","ARW,↑WSE =",{"$f":"IF($D$22=\"No\",0,IF($U$15>$AE$8,$AB$77,IF($U$10<$AE$8,0,IF($D$22=\"\",0,$AB$77-(($Y$76*$Y$77*((PI()/2)+ASIN($Y$78/$Y$76)))+($Y$77*$Y$78*(SQRT(($Y$76^2)-($Y$78^2))/$Y$76)))))))","v":0},"ft2",null,null,null,null,null,33,0,"None",{"$f":"$AL$45+ABS(AJ78*$M$19*$M$17)","v":0},0,{"$f":"$AN$45+ABS(AJ78*$M$19*$M$17)","v":0},0,false,0,0,0,"","",0,0,0,0,0,0,0,0,0,0,0,0,"","","","","","","",0,0,0,"",""]
[null,null,null,null,null,null,null,null,null,null,null,"Formatting",null,null,null,"cT",{"$f":"IF(OR($D$22=\"\",$D$22=\"No\",$F$22=\"\"),$Q$78,((((($B$53+$B$52)*$I$22)+($B$54*$J$22))*$Q$78)+(((($C$53+$C$52)*$I$22)+($C$54*$J$22))*$Q$77))/$E$55)","v":0},null,"ATSp,em =",{"$f":"$BE$43","v":0},"ft2",null,null,"d2 = (DRW/2) - (ythalweg-yRW,bot)",{"$f":"IF(OR($D$22=\"\",$F$22=\"\"),\"\",IF($U$15>=$C$16,$Y$76,$Y$76-($C$16-$U$15)))","v":""},"ft","ARW,↓bed =",{"$f":"IF($D$22=\"No\",0,IF($U$10<$C$16,$AB$77,IF($U$15>$C$16,0,IF($D$22=\"\",0,$AB$77-(($Y$76*$Y$77*((PI()/2)+ASIN($Y$79/$Y$76)))+($Y$77*$Y$79*(SQRT(($Y$76^2)-($Y$79^2))/$Y$76)))))))","v":0},"ft2",null,null,null,null,null,34,0,"None",0,0,0,0,false,0,0,0,"","",0,0,0,0,0,0,0,0,0,0,0,0,"","","","","","","",0,0,0,"",""]
["Anchor Forces",null,null,null,null,null,null,null,null,null,null,{"$f":"'2-Constants'!$C$7","v":2},null,null,null,null,null,null,"(-) ATSp,dry,em =",{"$f":"-$BG$43","v":0},"ft3",null,null,null,null,null,"ARWp =",{"$f":"IF($D$22=\"\",0,$AB$77-$AB$78-$AB$79)","v":0},"ft2",null,null,null,null,null,35,0,"None",0,0,0,0,false,0,0,0,"","",0,0,0,0,0,0,0,0,0,0,0,0,"","","","","","","",0,0,0,"",""]
["Additional Soil Ballast",null,null,null,null,null,null,"Mechanical Anchors",null,null,{"$f":"IF(OR($H$83<>\"\",$H$84<>\"\",$C$87<>\"\",$C$88<>\"\",$C$89<>\"\"),\"CHECK--Verify anchors are correctly located on X-Sect (above)\",\"\")","v":""},"Formatting",null,null,null,"Buried anchors","Number",null,"ATSp,wet =",{"$f":"IF($D$22=\"\",\"\",IF($T$88=\"Dry\",0,$T$77-$T$78-$T$79-$T$80))","v":""},"ft2",null,null,null,null,null,null,null,null,null,null,null,null,null,36,0,"None",0,0,0,0,false,0,0,0,"","",0,0,0,0,0,0,0,0,0,0,0,0,"","","","","","","",0,0,0,"",""]
["VAdry (ft3)","VAwet (ft3)","cAsoil (ft)","FA,Vsoil (lbf)","FA,HP (lbf)",null,"Type","cAm (ft)","Soils","FAm (lbf)","Quick Design Reference:",{"$f":"IF($D$83=\"\",0,-$D$83)","v":0},{"$f":"IF($E$83=\"\",0,-$E$83)","v":0},null,"Total (lbf)",{"$f":"$J$83+$J$84+(IF($A$87=\"Deadman\",$F$87-$G$87,0))+(IF($A$88=\"Deadman\",$F$88-$G$88,0))+(IF($A$89=\"Deadman\",$F$89-$G$89,0))","v":0},{"$f":"(IF($J$83>0,1,0))+(IF($J$84>0,1,0))+(IF(AND($I$87>0,$A$87=\"Deadman\"),1,0))+(IF(AND($I$88>0,$A$88=\"Deadman\"),1,0))+(IF(AND($I$89>0,$A$89=\"Deadman\"),1,0))","v":0},null,null,null,null,null,null,null,null,null,null,null,null,null,null,null,null,null,37,0,"None",0,0,0,0,false,0,0,0,"","",0,0,0,0,0,0,0,0,0,0,0,0,"","","","","","","",0,0,0,"",""]
[null,null,null,{"$f":"IF(AND($A$83=\"\",$B$83=\"\"),0,($A$83*$D$28)+($B$83*$E$28))","v":0},{"$f":"IF($D$83=0,0,0.5*$B$71*$D$83)","v":0},null,null,null,{"$f":"$W$100","v":""},{"$f":"IF(OR($G83=\"\",$H83=\"\"),0,IF(AND($W100=\"Bed\",$G$28=4),HLOOKUP($G$83,AnchorRatings,3,0),IF(AND($W100=\"Bed\",$G$28=5),HLOOKUP($G$83,AnchorRatings,4,0),IF(AND($W100=\"Bed\",$G$28=6),HLOOKUP($G$83,AnchorRatings,5,0),IF(AND($W100=\"Bed\",$G$28=7),HLOOKUP($G$83,AnchorRatings,6,0),IF(AND($W100=\"Bank\",$G$29=4),HLOOKUP($G$83,AnchorRatings,3,0),IF(AND($W100=\"Bank\",$G$29=5),HLOOKUP($G$83,AnchorRatings,4,0),IF(AND($W100=\"Bank\",$G$29=6),HLOOKUP($G$83,AnchorRatings,5,0),IF(AND($W100=\"Bank\",$G$29=7),HLOOKUP($G$83,AnchorRatings,6,0))))))))))","v":0},{"$f":"$I$61","v":0},0,{"$f":"(IF($A87=\"Behind\",-$J87,0))","v":0},null,"Required Vertical Resistance (lbf)",{"$f":"($L$54+$L$55+(IF($L$58>0,$L$58,0)))*$L$61","v":0},null,null,null,null,null,null,null,null,null,null,null,null,null,null,null,null,null,null,38,0,"None",0,0,0,0,false,0,0,0,"","",0,0,0,0,0,0,0,0,0,0,0,0,"","","","","","","",0,0,0,"",""]
[null,null,null,null,null,null,null,null,{"$f":"$W$101","v":""},{"$f":"IF(OR($G84=\"\",$H84=\"\"),0,IF(AND($W101=\"Bed\",$G$28=4),HLOOKUP($G$84,AnchorRatings,3,0),IF(AND($W101=\"Bed\",$G$28=5),HLOOKUP($G$84,AnchorRatings,4,0),IF(AND($W101=\"Bed\",$G$28=6),HLOOKUP($G$84,AnchorRatings,5,0),IF(AND($W101=\"Bed\",$G$28=7),HLOOKUP($G$84,AnchorRatings,6,0),IF(AND($W101=\"Bank\",$G$29=4),HLOOKUP($G$84,AnchorRatings,3,0),IF(AND($W101=\"Bank\",$G$29=5),HLOOKUP($G$84,AnchorRatings,4,0),IF(AND($W101=\"Bank\",$G$29=6),HLOOKUP($G$84,AnchorRatings,5,0),IF(AND($W101=\"Bank\",$G$29=7),HLOOKUP($G$84,AnchorRatings,6,0))))))))))","v":0},{"$f":"'2-Constants'!$C$5","v":1.5},0,{"$f":"(IF($A88=\"Behind\",-$J88,0))","v":0},null,"Actual Vertical Resistance (lbf)",{"$f":"ABS($L$56+$L$57+(IF($L$58<0,$L$58,0))+$L$59)","v":0},null,null,"Log Position","Water and Log Intercept",null,null,null,null,"Soil","LW Buried at Intercept?",null,"Log Position","Water and Log Intercept at Face",null,null,null,null,null,39,0,"None",0,0,0,0,false,0,0,0,"","",0,0,0,0,0,0,0,0,0,0,0,0,"","","","","","","",0,0,0,"",""]
["Boulder Ballast",null,null,null,null,null,null,null,null,null,null,0,{"$f":"(IF($A89=\"Behind\",-$J89,0))","v":0},null,"Extra Needed Vertical Resistance (lbf)",{"$f":"$P$83-$P$84","v":0},null,null,null,"Condition","Intercept Zone",null,"xTS (ft)","yTS (ft)","ysoil (ft)",null,null,null,"Condition","xTS (ft)","yTS (ft)","hTS,dry (ft)",null,null,40,0,"None",0,0,0,0,false,0,0,0,"","",0,0,0,0,0,0,0,0,0,0,0,0,"","","","","","","",0,0,0,"",""]
["Position","Dr (ft)","cAr (ft)","Vr,dry (ft3)","Vr,wet (ft3)","Wr (lbf)","FL,r (lbf)","FD,r (lbf)","FA,Vr (lbf)","FA,Hr (lbf)",{"$f":"$I$72","v":0},{"$f":"$L$82+$L$83+$L$84+$L$85","v":0},{"$f":"$M$82+$M$83+$M$84+$M$85","v":0},null,"Required Horizontal Resistance (lbf)",{"$f":"($L$66+(IF($L$69>0,$L$69,0)))*$L$72","v":0},null,null,"Crown",{"$f":"IF(OR($E$22=\"\",$F$22=\"\",$F$25=\"\",$G$25=\"\"),\"\",IF($X$39<=$AE$12,\"Submerged\",IF($X$38>$AE$12,\"Dry\",\"Partial\")))","v":""},{"$f":"IF($X$86=\"\",\"None\",IF($W$86<$B$14,\"Left Floodplain\",IF($W$86<$B$15,\"Left Bank\",IF($W$86<$B$16,\"Left Stream Bed\",IF($W$86<$B$17,\"Right Stream Bed\",IF($W$86<$B$18,\"Right Bank\",\"Right Floodplain\"))))))","v":"None"},{"$f":"IF($U$47=0,0,IF(OR($B$25=0,$B$25=180,$B$25=360),$E$22-ABS(($X$39-$W$47)/$M$20),IF(AND($U$38<=$U$39,$X$38>=$Y$38),ABS(($X$38-$W$47)/($AA$40*$M$17*$M$19)),IF(AND($U$38<=$U$39,$X$38<$Y$38),ABS($E$22-(ABS(($X$38-$W$47)/($AA$40*$M$17*$M$19)))),IF(AND($U$38>$U$39,$X$39>=$Y$39),ABS(($X$39-$W$47)/($AA$40*$M$17*$M$19)),IF(AND($U$38>=$U$39,$X$39<$Y$39),ABS($E$22-(ABS(($X$38-$W$47)/($AA$40*$M$17*$M$19))))))))))","v":0},{"$f":"IF($X$86=\"\",\"\",$U$39-(($X$39-$AE$8)/$AA$40))","v":""},{"$f":"IF($T$86=\"Partial\",$AE$12,\"\")","v":""},{"$f":"IF($X$86=\"\",\"\",IF($W$86<$B$14,(($W$86-$B$13)*$AB$31)+$C$13,IF($W$86<$B$15,(($W$86-$B$14)*$AB$32)+$C$14,IF($W$86<$B$16,(($W$86-$B$15)*$AB$33)+$C$15,IF($W$86<$B$17,(($W$86-$B$16)*$AB$34)+$C$16,IF($W$86<$B$18,(($W$86-$B$17)*$AB$35)+$C$17,IF($W$86<$B$19,(($W$86-$B$18)*$AB$36)+$C$18)))))))","v":""},{"$f":"IF($X$86=\"\",\"\",IF($X$86<=$Y$86,\"Yes\",\"No\"))","v":""},null,"Upper Face",{"$f":"IF($T$86=\"\",\"\",IF($X$41>$AE$8,\"Dry\",IF($T$86=\"Submerged\",\"Submerged\",\"Partial\")))","v":""},{"$f":"IF($AE$86=\"\",\"\",$U$39-(($X$39-$AE$8)/$AB$40))","v":""},{"$f":"IF($AC$86=\"Partial\",$AE$12,\"\")","v":""},{"$f":"IF($AC$86=\"Submerged\",0,IF($AC$86=\"Dry\",$F$22,($X$39-$AE$8)/$M$19))","v":{"$error":"#DIV/0!"}},null,null,41,0,"None",0,0,0,0,false,0,0,0,"","",0,0,0,0,0,0,0,0,0,0,0,0,"","","","","","","",0,0,0,"",""]
[null,null,null,{"$f":"IF(OR($B87=\"\",$C87=\"\"),\"\",(PI()*($B87^3)/6)-$E87)","v":""},{"$f":"IF($B87=\"\",\"\",$U94)","v":""},{"$f":"IF(OR($B87=\"\",$C87=\"\"),\"\",($D87*DUWRock)+($E87*(DUWRock-SWWater)))","v":""},{"$f":"IF(OR($B87=\"\",$C87=\"\"),\"\",$Q99)","v":""},{"$f":"IF(OR($B87=\"\",$C87=\"\"),\"\",$P99)","v":""},{"$f":"IF(OR($B87=\"\",$C87=\"\"),0,IF($A87=\"Behind\",0,IF(AND($A87=\"Deadman\",$P$85<=0),0,IF(AND($A87=\"Deadman\",$P$82>=$P$85),($F87-$G87)*($P$85/$P$82),$F87-$G87))))","v":0},{"$f":"IF(OR($B87=\"\",$C87=\"\"),0,IF($A87=\"Above\",0,IF($A87=\"Deadman\",($F87-$G87)-$I87,IF(AND($A87=\"Behind\",OR($W94=\"Left Stream Bed\",$W94=\"Right Stream Bed\")),(($F87-$G87)*$E$70)-$H87,(($F87-$G87)*$E$71)-$H87))))","v":0},{"$f":"'2-Constants'!$C$6","v":2},{"$f":"IF($J83=0,0,IF($P$85<=0,0,IF($P$82>=$P$85,-J$83*($P$85/$P$82),-$J83)))","v":0},{"$f":"-($J83+$L87)","v":0},null,"Actual Horizontal Resistance (lbf)",{"$f":"ABS($L$67+$L$68+(IF($L$69<0,$L$69,0))+$L$70)","v":0},null,null,"Centerline",{"$f":"IF(OR($E$22=\"\",$F$22=\"\",$F$25=\"\",$G$25=\"\"),\"\",IF($X$43<=$AE$12,\"Submerged\",IF($X$42>=$AE$12,\"Dry\",\"Partial\")))","v":""},{"$f":"IF($X$87=\"\",\"None\",IF($W$87<$B$14,\"Left Floodplain\",IF($W$87<$B$15,\"Left Bank\",IF($W$87<$B$16,\"Left Stream Bed\",IF($W$87<$B$17,\"Right Stream Bed\",IF($W$87<$B$18,\"Right Bank\",\"Right Floodplain\"))))))","v":"None"},{"$f":"IF($U$47=0,0,IF(OR($B$25=0,$B$25=180,$B$25=360),$E$22-ABS(($X$39-$W$47)/$M$20),IF(AND($U$38<=$U$39,$X$38>=$Y$38),ABS(($X$38-$W$47)/($AA$40*$M$17*$M$19)),IF(AND($U$38<=$U$39,$X$38<$Y$38),ABS($E$22-(ABS(($X$38-$W$47)/($AA$40*$M$17*$M$19)))),IF(AND($U$38>$U$39,$X$39>=$Y$39),ABS(($X$39-$W$47)/($AA$40*$M$17*$M$19)),IF(AND($U$38>=$U$39,$X$39<$Y$39),ABS($E$22-(ABS(($X$38-$W$47)/($AA$40*$M$17*$M$19))))))))))","v":0},{"$f":"IF($X$87=\"\",\"\",$U$43-(($X$43-$AE$8)/$AA$40))","v":""},{"$f":"IF($T$87=\"Partial\",$AE$12,\"\")","v":""},{"$f":"IF($X$87=\"\",\"\",IF($W$87<$B$14,(($W$87-$B$13)*$AB$31)+$C$13,IF($W$87<$B$15,(($W$87-$B$14)*$AB$32)+$C$14,IF($W$87<$B$16,(($W$87-$B$15)*$AB$33)+$C$15,IF($W$87<$B$17,(($W$87-$B$16)*$AB$34)+$C$16,IF($W$87<$B$18,(($W$87-$B$17)*$AB$35)+$C$17,IF($W$87<$B$19,(($W$87-$B$18)*$AB$36)+$C$18)))))))","v":""},{"$f":"IF($X$87=\"\",\"\",IF($X$87<=$Y$87,\"Yes\",\"No\"))","v":""},null,"Lower Face",{"$f":"IF($T$88=\"\",\"\",IF($X$40>=$AE$8,\"Dry\",IF($X$38<=$AE$8,\"Submerged\",\"Partial\")))","v":""},{"$f":"IF($AE$87=\"\",\"\",$U$38-(($X$38-$AE$8)/$AB$40))","v":""},{"$f":"IF($AC$87=\"Partial\",$AE$12,\"\")","v":""},{"$f":"IF($AC$87=\"Submerged\",0,IF($AC$87=\"Dry\",$F$22,($X$38-$AE$8)/$M$19))","v":{"$error":"#DIV/0!"}},null,null,42,0,"None",0,0,0,0,false,0,0,0,"","",0,0,0,0,0,0,0,0,0,0,0,0,"","","","","","","",0,0,0,"",""]
[null,null,null,{"$f":"IF(OR($B88=\"\",$C88=\"\"),\"\",(PI()*($B88^3)/6)-$E88)","v":""},{"$f":"IF($B88=\"\",\"\",$U95)","v":""},{"$f":"IF(OR($B88=\"\",$C88=\"\"),\"\",($D88*DUWRock)+($E88*(DUWRock-SWWater)))","v":""},{"$f":"IF(OR($B88=\"\",$C88=\"\"),\"\",$Q100)","v":""},{"$f":"IF(OR($B88=\"\",$C88=\"\"),\"\",$P100)","v":""},{"$f":"IF(OR($B88=\"\",$C88=\"\"),0,IF($A88=\"Behind\",0,IF(AND($A88=\"Deadman\",$P$85<=0),0,IF(AND($A88=\"Deadman\",$P$82>=$P$85),($F88-$G88)*($P$85/$P$82),$F88-$G88))))","v":0},{"$f":"IF(OR($B88=\"\",$C88=\"\"),0,IF($A88=\"Above\",0,IF($A88=\"Deadman\",($F88-$G88)-$I88,IF(AND($A88=\"Behind\",OR($W95=\"Left Stream Bed\",$W95=\"Right Stream Bed\")),(($F88-$G88)*$E$70)-$H88,(($F88-$G88)*$E$71)-$H88))))","v":0},null,{"$f":"IF($J84=0,0,IF($P$85<=0,0,IF($P$82>=$P$85,-J$84*($P$85/$P$82),-$J84)))","v":0},{"$f":"-($J84+$L88)","v":0},null,"Extra needed Horizontal Resistance (lbf)",{"$f":"$P$86-$P$87","v":0},null,null,"Bottom",{"$f":"IF(OR($E$22=\"\",$F$22=\"\",$F$25=\"\",$G$25=\"\"),\"\",IF($X$41<=$AE$12,\"Submerged\",IF($X$40>=$AE$12,\"Dry\",\"Partial\")))","v":""},{"$f":"IF($X$88=\"\",\"None\",IF($W$88<$B$14,\"Left Floodplain\",IF($W$88<$B$15,\"Left Bank\",IF($W$88<$B$16,\"Left Stream Bed\",IF($W$88<$B$17,\"Right Stream Bed\",IF($W$88<$B$18,\"Right Bank\",\"Right Floodplain\"))))))","v":"None"},{"$f":"IF($U$47=0,0,IF(OR($B$25=0,$B$25=180,$B$25=360),$E$22-ABS(($X$39-$W$47)/$M$20),IF(AND($U$38<=$U$39,$X$38>=$Y$38),ABS(($X$38-$W$47)/($AA$40*$M$17*$M$19)),IF(AND($U$38<=$U$39,$X$38<$Y$38),ABS($E$22-(ABS(($X$38-$W$47)/($AA$40*$M$17*$M$19)))),IF(AND($U$38>$U$39,$X$39>=$Y$39),ABS(($X$39-$W$47)/($AA$40*$M$17*$M$19)),IF(AND($U$38>=$U$39,$X$39<$Y$39),ABS($E$22-(ABS(($X$38-$W$47)/($AA$40*$M$17*$M$19))))))))))","v":0},{"$f":"IF($X$88=\"\",\"\",$U$41-(($X$41-$AE$8)/$AA$40))","v":""},{"$f":"IF($T$88=\"Partial\",$AE$12,\"\")","v":""},{"$f":"IF($X$88=\"\",\"\",IF($W$88<$B$14,(($W$88-$B$13)*$AB$31)+$C$13,IF($W$88<$B$15,(($W$88-$B$14)*$AB$32)+$C$14,IF($W$88<$B$16,(($W$88-$B$15)*$AB$33)+$C$15,IF($W$88<$B$17,(($W$88-$B$16)*$AB$34)+$C$16,IF($W$88<$B$18,(($W$88-$B$17)*$AB$35)+$C$17,IF($W$88<$B$19,(($W$88-$B$18)*$AB$36)+$C$18)))))))","v":""},{"$f":"IF($X$88=\"\",\"\",IF($X$88<=$Y$88,\"Yes\",\"No\"))","v":""},null,null,null,null,null,null,null,null,43,0,"None",0,0,0,0,false,0,0,0,"","",0,0,0,0,0,0,0,0,0,0,0,0,"","","","","","","",0,0,0,"",""]
[null,null,null,{"$f":"IF(OR($B89=\"\",$C89=\"\"),\"\",(PI()*($B89^3)/6)-$E89)","v":""},{"$f":"IF($B89=\"\",\"\",$U96)","v":""},{"$f":"IF(OR($B89=\"\",$C89=\"\"),\"\",($D89*DUWRock)+($E89*(DUWRock-SWWater)))","v":""},{"$f":"IF(OR($B89=\"\",$C89=\"\"),\"\",$Q101)","v":""},"",{"$f":"IF(OR($B89=\"\",$C89=\"\"),0,IF($A89=\"Behind\",0,IF(AND($A89=\"Deadman\",$P$85<=0),0,IF(AND($A89=\"Deadman\",$P$82>=$P$85),($F89-$G89)*($P$85/$P$82),$F89-$G89))))","v":0},{"$f":"IF(OR($B89=\"\",$C89=\"\"),0,IF($A89=\"Above\",0,IF($A89=\"Deadman\",($F89-$G89)-$I89,IF(AND($A89=\"Behind\",OR($W96=\"Left Stream Bed\",$W96=\"Right Stream Bed\")),(($F89-$G89)*$E$70)-$H89,(($F89-$G89)*$E$71)-$H89))))","v":0},{"$f":"I78","v":0},{"$f":"-$I87","v":0},{"$f":"IF($A87=\"Deadman\",-$J87,0)","v":0},null,null,null,null,null,null,null,null,null,null,null,null,null,null,null,null,null,null,null,null,null,44,0,"None",0,0,0,0,false,0,0,0,"","",0,0,0,0,0,0,0,0,0,0,0,0,"","","","","","","",0,0,0,"",""]
[null,null,null,null,null,null,null,null,null,null,{"$f":"'2-Constants'!$C$7","v":2},{"$f":"-$I88","v":0},{"$f":"IF($A88=\"Deadman\",-$J88,0)","v":0},null,null,null,null,null,null,null,null,null,null,null,null,null,null,null,null,null,null,null,null,null,45,0,"None",0,0,0,0,false,0,0,0,"","",0,0,0,0,0,0,0,0,0,0,0,0,"","","","","","","",0,0,0,"",""]
[{"$f":"IF($A$6=\"\",\"\",$A$6)","v":""},{"$f":"IF($A$6=\"\",\"\",$B$6)","v":""},null,{"$f":"IF(OR($B$9=\"N/A\",$B$9=\"\"),\"\",$B$9)","v":""},{"$f":"IF($D$48=\"\",\"\",\"Log ID\")","v":""},{"$f":"IF($D$48=\"\",\"\",$C$9)","v":""},null,null,null,"Page 3",null,{"$f":"-$I89","v":0},{"$f":"IF($A89=\"Deadman\",-$J89,0)","v":0},null,null,null,null,null,null,null,"A = [(R - ddry)*SQRT(2Rddry - ddry2)] - R2 arccos [(R - ddry)/R]",null,null,null,null,null,null,"Boulder #1",null,"Boulder #2",null,"Boulder #3",null,null,46,0,"None",0,0,0,0,false,0,0,0,"","",0,0,0,0,0,0,0,0,0,0,0,0,"","","","","","","",0,0,0,"",""]
["Interaction Forces with Adjacent Logs",null,null,null,null,null,null,null,null,null,null,{"$f":"$L$87+$L$88+$L$89+$L$90+$L$91","v":0},{"$f":"$M$87+$M$88+$M$89+$M$90+$M$91","v":0},"←Flex anchors","Ballast Boulder Calculations",null,null,null,null,null,null,null,null,null,null,null,null,"xTS (ft)","yTS (ft)","xTS (ft)","yTS (ft)","xTS (ft)","yTS (ft)",null,47,0,"None",0,0,0,0,false,0,0,0,"","",0,0,0,0,0,0,0,0,0,0,0,0,"","","","","","","",0,0,0,"",""]
[null,null,null,null,null,null,"Applied Forces from other Logs",null,null,null,{"$f":"IF(OR($B$95<>\"\",$B$96<>\"\",$B$97<>\"\",$B$98<>\"\"),\"NOTE -- The page is not formatted to print the Interaction Forces\",\"\")","v":""},null,null,null,null,"xr,bot (ft)","yr,bot (ft)","yTS,bot (ft)","ysoil (ft)","dr,dry (ft)","Vr,wet (ft3)","Ar↑WSE (ft2)","Zone","dr↓Thw (ft)","Ar↓Thw (ft2)","APr (ft2)","Point 1",{"$f":"IF($P$94=\"\",0,$P$94)","v":0},{"$f":"IF($Q$94=\"\",$C$13,$Q$94)","v":0},{"$f":"IF($P$95=\"\",0,$P$95)","v":0},{"$f":"IF($Q$95=\"\",$C$13,$Q$95)","v":0},{"$f":"IF($P$96=\"\",0,$P$96)","v":0},{"$f":"IF($Q$96=\"\",$C$13,$Q$96)","v":0},null,48,0,"None",0,0,0,0,false,0,0,0,"","",0,0,0,0,0,0,0,0,0,0,0,0,"","","","","","","",0,0,0,"",""]
["Log ID","Position","Link","cWI (ft)","FW,V (lbf)","FW,H (lbf)","FW,V (lbf)",null,"FW,H (lbf)",null,null,"Formatting",null,null,"Boulder 1",{"$f":"IF(OR($F$25=\"\",$C87=\"\"),\"\",$AE$49-(($C87*$M$19)*$M$17))","v":""},{"$f":"IF(OR($G$25=\"\",$C87=\"\"),\"\",IF($A87=\"Behind\",MIN($R94,$S94),IF($A87=\"Deadman\",(MIN($R94,$S94))-($F$22+1),$R94+$F$22)))","v":""},{"$f":"IF($P94=\"\",\"\",($AF$49+(($P94-$AE$49)*$AA$40))-($F$22/2))","v":""},{"$f":"IF($P94=\"\",\"\",IF($P94<$B$14,(($P94-$B$13)*$AB$31)+$C$13,IF($P94<$B$15,(($P94-$B$14)*$AB$32)+$C$14,IF($P94<$B$16,(($P94-$B$15)*$AB$33)+$C$15,IF($P94<$B$17,(($P94-$B$16)*$AB$34)+$C$16,IF($P94<$B$18,(($P94-$B$17)*$AB$35)+$C$17,IF($P94<$B$19,(($P94-$B$18)*$AB$36)+$C$18)))))))","v":""},{"$f":"IF($Q94=\"\",\"\",IF(($Q94+$B87-$AE$8)>=$B87,$B87,IF(($Q94+$B87)>$AE$8,($Q94+$B87)-$AE$8,0)))","v":""},{"$f":"IF($T94=\"\",\"\",IF($T94>=$B87,0,(PI()/3)*(($B87-$T94)^2)*((1.5*$B87)-($B87-$T94))))","v":""},{"$f":"IF($C87=\"\",\"\",IF($A87=\"Deadman\",0,IF($Q94>=$AE$8,PI()*(($B87/2)^2),((($B87/2)^2)*ACOS((($B87/2)-$T94)/($B87/2)))-((($B87/2)-$T94)*SQRT(2*($B87/2)*$T94-($T94^2))))))","v":""},{"$f":"IF($P94=\"\",\"\",IF(OR($C$19=\"\",$F$25=\"\",$G$25=\"\"),\"None\",IF($P94<$B$14,\"Left Floodplain\",IF($P94<$B$15,\"Left Bank\",IF($P94<$B$16,\"Left Stream Bed\",IF($P94<$B$17,\"Right Stream Bed\",IF($P94<$B$18,\"Right Bank\",\"Right Floodplain\")))))))","v":""},{"$f":"IF($Q94=\"\",\"\",IF(($Q94+$B87)<=$S94,$B87,IF($Q94>=$S94,0,$S94-$Q94)))","v":""},{"$f":"IF($C87=\"\",\"\",IF($A87=\"Deadman\",PI()*(($B87/2)^2),IF($Q94>$S94,0,((($B87/2)^2)*ACOS((($B87/2)-$X94)/($B87/2)))-((($B87/2)-$X94)*SQRT(2*($B87/2)*$X94-($X94^2))))))","v":""},{"$f":"IF($C87=\"\",\"\",IF(((PI()*(($B87/2)^2))-$V94-$Y94)<0,0,(PI()*(($B87/2)^2))-$V94-$Y94))","v":""},"Point 2",{"$f":"IF($AB$93=\"\",0,$AB$93-($B$87/4))","v":0},{"$f":"IF($AC$93=\"\",$C$13,$AC$93+($B$87/25))","v":0},{"$f":"IF($AD$93=\"\",0,$AD$93-($B$88/4))","v":0},{"$f":"IF($AE$93=\"\",$C$13,$AE$93+($B$88/25))","v":0},{"$f":"IF($AF$93=\"\",0,$AF$93-($B$89/4))","v":0},{"$f":"IF($AG$93=\"\",$C$13,$AG$93+($B$89/25))","v":0},null,49,0,"None",0,0,0,0,false,0,0,0,"","",0,0,0,0,0,0,0,0,0,0,0,0,"","","","","","","",0,0,0,"",""]
[null,null,null,null,null,null,{"$f":"IF(OR($E$95=\"\",$E$95=0),0,IF($C$95=\"Pinned\",ABS($E$95),IF(AND($C$95=\"Gravity\",$B$95=\"Below\",$E$95>=0),ABS($E$95),IF(AND($C$95=\"Gravity\",$B$95=\"Above\",$E$95<=0),ABS($E$95),0))))","v":0},{"$f":"IF($L$95=0,\"\",IF($L$95>0,CHAR(233),CHAR(234)))","v":""},{"$f":"IF(OR($F$95=\"\",$F$95=0),0,IF($C$95=\"Pinned\",ABS($F$95),IF(AND($C$95=\"Gravity\",$B$95=\"Behind\",$F$95<0),ABS($F$95),IF(AND($C$95=\"Gravity\",$B$95=\"In front\",$F$95>0),ABS($F$95),0))))","v":0},{"$f":"IF($M$95=0,\"\",IF($M$95>=0,CHAR(232),CHAR(231)))","v":""},null,{"$f":"IF($G$95=0,0,$E$95)","v":0},{"$f":"IF($I$95=0,0,$F$95)","v":0},null,"Boulder 2",{"$f":"IF(OR($F$25=\"\",$C88=\"\"),\"\",$AE$49-(($C88*$M$19)*$M$17))","v":""},{"$f":"IF(OR($G$25=\"\",$C88=\"\"),\"\",IF($A88=\"Behind\",MIN($R95,$S95),IF($A88=\"Deadman\",(MIN($R95,$S95))-($F$22+1),$R95+$F$22)))","v":""},{"$f":"IF($P95=\"\",\"\",($AF$49+(($P95-$AE$49)*$AA$40))-($F$22/2))","v":""},{"$f":"IF($P95=\"\",\"\",IF($P95<$B$14,(($P95-$B$13)*$AB$31)+$C$13,IF($P95<$B$15,(($P95-$B$14)*$AB$32)+$C$14,IF($P95<$B$16,(($P95-$B$15)*$AB$33)+$C$15,IF($P95<$B$17,(($P95-$B$16)*$AB$34)+$C$16,IF($P95<$B$18,(($P95-$B$17)*$AB$35)+$C$17,IF($P95<$B$19,(($P95-$B$18)*$AB$36)+$C$18)))))))","v":""},{"$f":"IF($Q95=\"\",\"\",IF(($Q95+$B88-$AE$8)>=$B88,$B88,IF(($Q95+$B88)>$AE$8,($Q95+$B88)-$AE$8,0)))","v":""},{"$f":"IF($T95=\"\",\"\",IF($T95>=$B88,0,(PI()/3)*(($B88-$T95)^2)*((1.5*$B88)-($B88-$T95))))","v":""},{"$f":"IF($C88=\"\",\"\",IF($A88=\"Deadman\",0,IF($Q95>=$AE$8,PI()*(($B88/2)^2),((($B88/2)^2)*ACOS((($B88/2)-$T95)/($B88/2)))-((($B88/2)-$T95)*SQRT(2*($B88/2)*$T95-($T95^2))))))","v":""},{"$f":"IF($P95=\"\",\"\",IF(OR($C$19=\"\",$F$25=\"\",$G$25=\"\"),\"None\",IF($P95<$B$14,\"Left Floodplain\",IF($P95<$B$15,\"Left Bank\",IF($P95<$B$16,\"Left Stream Bed\",IF($P95<$B$17,\"Right Stream Bed\",IF($P95<$B$18,\"Right Bank\",\"Right Floodplain\")))))))","v":""},{"$f":"IF($Q95=\"\",\"\",IF(($Q95+$B88)<=$S95,$B88,IF($Q95>=$S95,0,$S95-$Q95)))","v":""},{"$f":"IF($C88=\"\",\"\",IF($A88=\"Deadman\",PI()*(($B88/2)^2),IF($Q95>$S95,0,((($B88/2)^2)*ACOS((($B88/2)-$X95)/($B88/2)))-((($B88/2)-$X95)*SQRT(2*($B88/2)*$X95-($X95^2))))))","v":""},{"$f":"IF($C88=\"\",\"\",IF(((PI()*(($B88/2)^2))-$V95-$Y95)<0,0,(PI()*(($B88/2)^2))-$V95-$Y95))","v":""},"Point 3",{"$f":"IF($AB$93=\"\",0,$AB$93-($B$87/2))","v":0},{"$f":"IF($AC$93=\"\",$C$13,$AC$93+($B$87/2))","v":0},{"$f":"IF($AD$93=\"\",0,$AD$93-($B$88/2))","v":0},{"$f":"IF($AE$93=\"\",$C$13,$AE$93+($B$88/2))","v":0},{"$f":"IF($AF$93=\"\",0,$AF$93-($B$89/2))","v":0},{"$f":"IF($AG$93=\"\",$C$13,$AG$93+($B$89/2))","v":0},null,50,0,"None",0,0,0,0,false,0,0,0,"","",0,0,0,0,0,0,0,0,0,0,0,0,"","","","","","","",0,0,0,"",""]
[null,null,null,null,null,null,{"$f":"IF(OR($E$96=\"\",$E$96=0),0,IF($C$96=\"Pinned\",ABS($E$96),IF(AND($C$96=\"Gravity\",$B$96=\"Below\",$E$96>=0),ABS($E$96),IF(AND($C$96=\"Gravity\",$B$96=\"Above\",$E$96<=0),ABS($E$96),0))))","v":0},{"$f":"IF($L$96=0,\"\",IF($L$96>0,CHAR(233),CHAR(234)))","v":""},{"$f":"IF(OR($F$96=\"\",$F$96=0),0,IF($C$96=\"Pinned\",ABS($F$96),IF(AND($C$96=\"Gravity\",$B$96=\"Behind\",$F$96<0),ABS($F$96),IF(AND($C$96=\"Gravity\",$B$96=\"In front\",$F$96>0),ABS($F$96),0))))","v":0},{"$f":"IF($M$96=0,\"\",IF($M$96>=0,CHAR(232),CHAR(231)))","v":""},null,{"$f":"IF($G$96=0,0,$E$96)","v":0},{"$f":"IF($I$96=0,0,$F$96)","v":0},null,"Boulder 3",{"$f":"IF(OR($F$25=\"\",$C89=\"\"),\"\",$AE$49-(($C89*$M$19)*$M$17))","v":""},{"$f":"IF(OR($G$25=\"\",$C89=\"\"),\"\",IF($A89=\"Behind\",MIN($R96,$S96),IF($A89=\"Deadman\",(MIN($R96,$S96))-($F$22+1),$R96+$F$22)))","v":""},{"$f":"IF($P96=\"\",\"\",($AF$49+(($P96-$AE$49)*$AA$40))-($F$22/2))","v":""},{"$f":"IF($P96=\"\",\"\",IF($P96<$B$14,(($P96-$B$13)*$AB$31)+$C$13,IF($P96<$B$15,(($P96-$B$14)*$AB$32)+$C$14,IF($P96<$B$16,(($P96-$B$15)*$AB$33)+$C$15,IF($P96<$B$17,(($P96-$B$16)*$AB$34)+$C$16,IF($P96<$B$18,(($P96-$B$17)*$AB$35)+$C$17,IF($P96<$B$19,(($P96-$B$18)*$AB$36)+$C$18)))))))","v":""},{"$f":"IF($Q96=\"\",\"\",IF(($Q96+$B89-$AE$8)>=$B89,$B89,IF(($Q96+$B89)>$AE$8,($Q96+$B89)-$AE$8,0)))","v":""},{"$f":"IF($T96=\"\",\"\",IF($T96>=$B89,0,(PI()/3)*(($B89-$T96)^2)*((1.5*$B89)-($B89-$T96))))","v":""},{"$f":"IF($C89=\"\",\"\",IF($A89=\"Deadman\",0,IF($Q96>=$AE$8,PI()*(($B89/2)^2),((($B89/2)^2)*ACOS((($B89/2)-$T96)/($B89/2)))-((($B89/2)-$T96)*SQRT(2*($B89/2)*$T96-($T96^2))))))","v":""},{"$f":"IF($P96=\"\",\"\",IF(OR($C$19=\"\",$F$25=\"\",$G$25=\"\"),\"None\",IF($P96<$B$14,\"Left Floodplain\",IF($P96<$B$15,\"Left Bank\",IF($P96<$B$16,\"Left Stream Bed\",IF($P96<$B$17,\"Right Stream Bed\",IF($P96<$B$18,\"Right Bank\",\"Right Floodplain\")))))))","v":""},{"$f":"IF($Q96=\"\",\"\",IF(($Q96+$B89)<=$S96,$B89,IF($Q96>=$S96,0,$S96-$Q96)))","v":""},{"$f":"IF($C89=\"\",\"\",IF($A89=\"Deadman\",PI()*(($B89/2)^2),IF($Q96>$S96,0,((($B89/2)^2)*ACOS((($B89/2)-$X96)/($B89/2)))-((($B89/2)-$X96)*SQRT(2*($B89/2)*$X96-($X96^2))))))","v":""},{"$f":"IF($C89=\"\",\"\",IF(((PI()*(($B89/2)^2))-$V96-$Y96)<0,0,(PI()*(($B89/2)^2))-$V96-$Y96))","v":""},"Point 4",{"$f":"IF($AB$93=\"\",0,$AB$94)","v":0},{"$f":"IF($AC$97=\"\",$C$13,$AC$97-($B$87/25))","v":0},{"$f":"IF($AD$93=\"\",0,$AD$94)","v":0},{"$f":"IF($AE$97=\"\",$C$13,$AE$97-($B$88/25))","v":0},{"$f":"IF($AF$93=\"\",0,$AF$94)","v":0},{"$f":"IF($AG$97=\"\",$C$13,$AG$97-($B$89/25))","v":0},null,51,0,"None",0,0,0,0,false,0,0,0,"","",0,0,0,0,0,0,0,0,0,0,0,0,"","","","","","","",0,0,0,"",""]
[null,null,null,null,null,null,{"$f":"IF(OR($E$97=\"\",$E$97=0),0,IF($C$97=\"Pinned\",ABS($E$97),IF(AND($C$97=\"Gravity\",$B$97=\"Below\",$E$97>=0),ABS($E$97),IF(AND($C$97=\"Gravity\",$B$97=\"Above\",$E$97<=0),ABS($E$97),0))))","v":0},{"$f":"IF($L$97=0,\"\",IF($L$97>0,CHAR(233),CHAR(234)))","v":""},{"$f":"IF(OR($F$97=\"\",$F$97=0),0,IF($C$97=\"Pinned\",ABS($F$97),IF(AND($C$97=\"Gravity\",$B$97=\"Behind\",$F$97<0),ABS($F$97),IF(AND($C$97=\"Gravity\",$B$97=\"In front\",$F$97>0),ABS($F$97),0))))","v":0},{"$f":"IF($M$97=0,\"\",IF($M$97>=0,CHAR(232),CHAR(231)))","v":""},null,{"$f":"IF($G$97=0,0,$E$97)","v":0},{"$f":"IF($I$97=0,0,$F$97)","v":0},null,null,null,null,null,null,null,null,null,null,null,null,null,"Point 5",{"$f":"IF($AB$93=\"\",0,$AB$93)","v":0},{"$f":"IF($AC$93=\"\",$C$13,$AC$93+$B$87)","v":0},{"$f":"IF($AD$93=\"\",0,$AD$93)","v":0},{"$f":"IF($AE$93=\"\",$C$13,$AE$93+$B$88)","v":0},{"$f":"IF($AF$93=\"\",0,$AF$93)","v":0},{"$f":"IF($AG$93=\"\",$C$13,$AG$93+$B$89)","v":0},null,52,0,"None",0,0,0,0,false,0,0,0,"","",0,0,0,0,0,0,0,0,0,0,0,0,"","","","","","","",0,0,0,"",""]
[null,null,null,null,null,null,{"$f":"IF(OR($E$98=\"\",$E$98=0),0,IF($C$98=\"Pinned\",ABS($E$98),IF(AND($C$98=\"Gravity\",$B$98=\"Below\",$E$98>=0),ABS($E$98),IF(AND($C$98=\"Gravity\",$B$98=\"Above\",$E$98<=0),ABS($E$98),0))))","v":0},{"$f":"IF($L$98=0,\"\",IF($L$98>0,CHAR(233),CHAR(234)))","v":""},{"$f":"IF(OR($F$98=\"\",$F$98=0),0,IF($C$98=\"Pinned\",ABS($F$98),IF(AND($C$98=\"Gravity\",$B$98=\"Behind\",$F$98<0),ABS($F$98),IF(AND($C$98=\"Gravity\",$B$98=\"In front\",$F$98>0),ABS($F$98),0))))","v":0},{"$f":"IF($M$98=0,\"\",IF($M$98>=0,CHAR(232),CHAR(231)))","v":""},null,{"$f":"IF($G$98=0,0,$E$98)","v":0},{"$f":"IF($I$98=0,0,$F$98)","v":0},null,null,"FD,r (lbf)","FL,r (lbf)",null,null,null,"Soil Anchor Zone Calculation",null,null,null,null,null,"Point 6",{"$f":"IF($AB$93=\"\",0,$AB$93+($B$87/4))","v":0},{"$f":"IF($AC$93=\"\",$C$13,$AC$96)","v":0},{"$f":"IF($AD$93=\"\",\"\",$AD$93+($B$88/4))","v":0},{"$f":"IF($AE$93=\"\",$C$13,$AE$96)","v":0},{"$f":"IF($AF$93=\"\",0,$AF$93+($B$89/4))","v":0},{"$f":"IF($AG$93=\"\",$C$13,$AG$96)","v":0},null,53,0,"None",0,0,0,0,false,0,0,0,"","",0,0,0,0,0,0,0,0,0,0,0,0,"","","","","","","",0,0,0,"",""]
[null,null,null,null,null,null,null,null,null,null,null,{"$f":"$L$95+$L$96+$L$97+$L$98","v":0},{"$f":"$M$95+$M$96+$M$97+$M$98","v":0},null,"Boulder 1",{"$f":"IF(OR($F$25=\"\",$C87=\"\"),\"\",IF($A87=\"Behind\",0.5*CDrock*$Z94*SWWater*($J$6^2)/(2*g),CDrock*$Z94*SWWater*($J$6^2)/(2*g)))","v":""},{"$f":"IF(OR($F$25=\"\",$C87=\"\"),\"\",IF($A87=\"Behind\",0.5*CLrock*$Z94*SWWater*(($J$6^2)/(2*g)),CLrock*$Z94*SWWater*(($J$6^2)/(2*g))))","v":""},null,null,null,null,"xr,bot (ft)","Zone",null,null,null,"Point 7",{"$f":"IF($AB$93=\"\",0,$AB$93+($B$87/2))","v":0},{"$f":"IF($AC$93=\"\",$C$13,$AC$95)","v":0},{"$f":"IF($AD$93=\"\",0,$AD$93+($B$88/2))","v":0},{"$f":"IF($AE$93=\"\",$C$13,$AE$95)","v":0},{"$f":"IF($AF$93=\"\",\"\",$AF$93+($B$89/2))","v":0},{"$f":"IF($AG$93=\"\",$C$13,$AG$95)","v":0},null,54,0,"None",0,0,0,0,false,0,0,0,"","",0,0,0,0,0,0,0,0,0,0,0,0,"","","","","","","",0,0,0,"",""]
[null,null,null,null,null,null,null,null,null,null,null,null,null,null,"Boulder 2",{"$f":"IF(OR($F$25=\"\",$C88=\"\"),\"\",IF($A88=\"Behind\",0.5*CDrock*$Z95*SWWater*($J$6^2)/(2*g),CDrock*$Z95*SWWater*($J$6^2)/(2*g)))","v":""},{"$f":"IF(OR($F$25=\"\",$C88=\"\"),\"\",IF($A88=\"Behind\",0.5*CLrock*$Z95*SWWater*(($J$6^2)/(2*g)),CLrock*$Z95*SWWater*(($J$6^2)/(2*g))))","v":""},null,null,null,"Anchor 1",{"$f":"IF(OR($F$25=\"\",$H83=\"\"),\"\",$AE$49-(($H83*$M$19)*$M$17))","v":""},{"$f":"IF($V100=\"\",\"\",IF(OR($C$19=\"\",$F$25=\"\",$G$25=\"\"),\"None\",IF($V100<$B$14,\"Bank\",IF($V100<$B$15,\"Bank\",IF($V100<$B$16,\"Bed\",IF($V100<$B$17,\"Bed\",IF($V100<$B$18,\"Bank\",\"Bank\")))))))","v":""},null,null,null,"Point 8",{"$f":"IF($AB$93=\"\",0,$AB$98)","v":0},{"$f":"IF($AC$93=\"\",$C$13,$AC$94)","v":0},{"$f":"IF($AD$93=\"\",0,$AD$98)","v":0},{"$f":"IF($AE$93=\"\",$C$13,$AE$94)","v":0},{"$f":"IF($AF$93=\"\",0,$AF$98)","v":0},{"$f":"IF($AG$93=\"\",$C$13,$AG$94)","v":0},null,55,0,"None",0,0,0,0,false,0,0,0,"","",0,0,0,0,0,0,0,0,0,0,0,0,"","","","","","","",0,0,0,"",""]
[null,null,null,null,null,null,null,null,null,null,null,null,null,null,"Boulder 3",{"$f":"IF(OR($F$25=\"\",$C89=\"\"),\"\",IF($A89=\"Behind\",0.5*CDrock*$Z96*SWWater*($J$6^2)/(2*g),CDrock*$Z96*SWWater*($J$6^2)/(2*g)))","v":""},{"$f":"IF(OR($F$25=\"\",$C89=\"\"),\"\",IF($A89=\"Behind\",0.5*CLrock*$Z96*SWWater*(($J$6^2)/(2*g)),CLrock*$Z96*SWWater*(($J$6^2)/(2*g))))","v":""},null,null,null,"Anchor 2",{"$f":"IF(OR($F$25=\"\",$H84=\"\"),\"\",$AE$49-(($H84*$M$19)*$M$17))","v":""},{"$f":"IF($V101=\"\",\"\",IF(OR($C$19=\"\",$F$25=\"\",$G$25=\"\"),\"None\",IF($V101<$B$14,\"Bank\",IF($V101<$B$15,\"Bank\",IF($V101<$B$16,\"Bed\",IF($V101<$B$17,\"Bed\",IF($V101<$B$18,\"Bank\",\"Bank\")))))))","v":""},null,null,null,"Point 9",{"$f":"IF($AB$93=\"\",0,$AB$93)","v":0},{"$f":"IF($AC$93=\"\",$C$13,$AC$93)","v":0},{"$f":"IF($AD$93=\"\",0,$AD$93)","v":0},{"$f":"IF($AE$93=\"\",$C$13,$AE$93)","v":0},{"$f":"IF($AF$93=\"\",0,$AF$93)","v":0},{"$f":"IF($AG$93=\"\",$C$13,$AG$93)","v":0},null,56,0,"None",0,0,0,0,false,0,0,0,"","",0,0,0,0,0,0,0,0,0,0,0,0,"","","","","","","",0,0,0,"",""]
[null,null,null,null,null,null,null,null,null,null,null,null,null,null,null,null,null,null,null,null,null,null,null,null,null,null,null,null,null,null,null,null,null,null,57,0,"None",0,0,0,0,false,0,0,0,"","",0,0,0,0,0,0,0,0,0,0,0,0,"","","","","","","",0,0,0,"",""]
[null,null,null,null,null,null,null,null,null,null,null,null,null,null,null,null,null,null,null,null,null,null,null,null,null,null,null,"Anchor #1",null,null,null,"Soil Ballast #1",null,null,58,0,"None",0,0,0,0,false,0,0,0,"","",0,0,0,0,0,0,0,0,0,0,0,0,"","","","","","","",0,0,0,"",""]
[null,null,null,null,null,null,null,null,null,null,null,null,null,null,null,null,null,null,null,null,null,null,null,null,null,null,null,"xTS (ft)","yTS (ft)",null,null,"xTS (ft)","yTS (ft)",null,59,0,"None",0,0,0,0,false,0,0,0,"","",0,0,0,0,0,0,0,0,0,0,0,0,"","","","","","","",0,0,0,"",""]
[null,null,null,null,null,null,null,null,null,null,null,null,null,null,null,null,null,null,null,null,null,null,null,null,null,null,"Point 1",{"$f":"IF(OR($F$25=\"\",$H83=\"\"),0,$AE$49-(($H83*$M$19)*$M$17))","v":0},{"$f":"IF(OR($AB105=\"\",$AB$105=0),$C$13,($AF$49+(($AB105-$AE$49)*$AA$40))-($F$22/2))","v":0},null,"Point 1",{"$f":"IF(OR($F$25=\"\",$C83=\"\"),0,($AE$49-(($C83*$M$19)*$M$17))+(ABS(2*$M$17*$M$19)))","v":0},{"$f":"IF(OR($AF105=\"\",$AF$105=0),$C$13,($AF$49+(($AF105-$AE$49)*$AA$40))+($F$22/2))","v":0},null,60,0,"None",0,0,0,0,false,0,0,0,"","",0,0,0,0,0,0,0,0,0,0,0,0,"","","","","","","",0,0,0,"",""]
[null,null,null,null,null,null,null,null,null,null,null,null,null,null,null,null,null,null,null,null,null,null,null,null,null,null,"Point 2",{"$f":"IF($AB105=\"\",0,$AB105)","v":0},{"$f":"IF(OR($AC105=\"\",$AB$105=0),$C$13,$AC105-4)","v":0},null,"Point 2",{"$f":"IF($AF105=\"\",0,$AF105)","v":0},{"$f":"IF(OR($AG105=\"\",$AF$105=0),$C$13,IF($AG$105>$AG$108,$AG105+2.25,$AG$108+2.25))","v":0},null,61,0,"None",0,0,0,0,false,0,0,0,"","",0,0,0,0,0,0,0,0,0,0,0,0,"","","","","","","",0,0,0,"",""]
[null,null,null,null,null,null,null,null,null,null,null,null,null,null,null,null,null,null,null,null,null,null,null,null,null,null,null,null,null,null,"Point 3",{"$f":"IF(OR($F$25=\"\",$C83=\"\"),0,($AE$49-(($C83*$M$19)*$M$17))-(ABS(2*$M$17*$M$19)))","v":0},{"$f":"IF(OR($AG106=\"\",$AF$105=0),$C$13,$AG106)","v":0},null,62,0,"None",0,0,0,0,false,0,0,0,"","",0,0,0,0,0,0,0,0,0,0,0,0,"","","","","","","",0,0,0,"",""]
[null,null,null,null,null,null,null,null,null,null,null,null,null,null,null,null,null,null,null,null,null,null,null,null,null,null,null,"Anchor #2",null,null,"Point 4",{"$f":"IF($AF105=\"\",0,$AF107)","v":0},{"$f":"IF(OR($AG105=\"\",$AF$105=0),$C$13,$AG105-((ABS($AF$105-$AF$108))*$AA$40))","v":0},null,63,0,"None",0,0,0,0,false,0,0,0,"","",0,0,0,0,0,0,0,0,0,0,0,0,"","","","","","","",0,0,0,"",""]
[null,null,null,null,null,null,null,null,null,null,null,null,null,null,null,null,null,null,null,null,null,null,null,null,null,null,null,"xTS (ft)","yTS (ft)",null,null,null,null,null,64,{"$f":"($AI109/$AI$245)*$AJ$245","v":0},{"$f":"IF(OR($C$19=\"\",$F$25=\"\",$G$25=\"\"),\"None\",IF(AL109<$B$14,\"Left Floodplain\",IF(AL109<$B$15,\"Left Bank\",IF(AL109<$B$16,\"Left Stream Bed\",IF(AL109<$B$17,\"Right Stream Bed\",IF(AL109<$B$18,\"Right Bank\",\"Right Floodplain\"))))))","v":"None"},0,0,0,0,{"$f":"IF($AL109<$B$14,(($AL109-$B$13)*$AB$31)+$C$13,IF($AL109<$B$15,(($AL109-$B$14)*$AB$32)+$C$14,IF($AL109<$B$16,(($AL109-$B$15)*$AB$33)+$C$15,IF($AL109<$B$17,(($AL109-$B$16)*$AB$34)+$C$16,IF($AL109<$B$18,(($AL109-$B$17)*$AB$35)+$C$17,IF($AL109<$B$19,(($AL109-$B$18)*$AB$36)+$C$18))))))","v":false},{"$f":"IF(OR($AP109<$AE$12,$AP109<=$AM109),0,IF(OR($AP109>=$AE$12,$AM109>=$AE$12),$AP109-$AM109-$AR109,$AP109-$AE$12))","v":0},{"$f":"IF($AP109<=$AM109,0,IF($AM109>=$AE$12,0,IF($AP109<=$AE$12,$AP109-$AM109,$AE$12-$AM109)))","v":0},{"$f":"IF(AP109<=AM109,0,AP109-AM109)","v":0},"","",0,{"$f":"IF($AP109<=$AO109,0,IF($AO109>=$AE$12,0,IF($AP109<=$AE$12,$AP109-$AO109,$AE$12-$AO109)))","v":0},{"$f":"IF(AP109<=AO109,0,AP109-AO109)","v":0},{"$f":"IF($AS109=0,0,IF(OR($AJ109=0,$AJ109=$E$22),$AJ$46/2,$AJ$46))","v":0},{"$f":"IF(OR($AK109=\"Left Stream Bed\",$AK109=\"Right Stream Bed\"),$F$22*$AQ109*$AY109,0)","v":0},{"$f":"IF(OR($AK109=\"Left Stream Bed\",$AK109=\"Right Stream Bed\"),$F$22*$AR109*$AY109,0)","v":0},{"$f":"IF(OR($AK109=\"Left Floodplain\",$AK109=\"Left Bank\",$AK109=\"Right Bank\",$AK109=\"Right Floodplain\"),$F$22*$AQ109*$AY109,0)","v":0},{"$f":"IF(OR($AK109=\"Left Floodplain\",$AK109=\"Left Bank\",$AK109=\"Right Bank\",$AK109=\"Right Floodplain\"),$F$22*$AR109*$AY109,0)","v":0},{"$f":"AX109-AS109","v":0},0,{"$f":"AV109-AQ109","v":0},{"$f":"IF(OR($AJ109=0,$AJ109=$E$22),($BF109*$AJ$46/2)*ABS($M$17),$BF109*$AJ$46*ABS($M$17))","v":0},{"$f":"IF(OR($AM109<$AP109,$AO109>$AE$8),\"\",IF(OR($AJ109=0,$AJ109=$E$22),$AJ$46/2,$AJ$46))","v":""},"","",{"$f":"IF($BJ109=\"\",\"\",IF(OR($BJ109>($F$22/2),$BJ109=0),0,0.45-($BJ109*0.45/($F$22/2))))","v":""},{"$f":"IF($BK109=\"\",\"\",IF($BK109>0,$AJ109,\"\"))","v":""},"","",{"$f":"IF($AO109=0,0,IF($AO109>$AP109,0,IF(OR($AJ109=0,$AJ109=$E$22),$AJ$46/2,$AJ$46)))","v":0},{"$f":"IF(AND($BO109>0,OR($AK109=\"Left Stream Bed\",$AK109=\"Right Stream Bed\")),$BO109,0)","v":0},{"$f":"IF(AND($BO109>0,OR($AK109=\"Left Floodplain\",$AK109=\"Left Bank\",$AK109=\"Right Bank\",$AK109=\"Right Floodplain\")),$BO109,0)","v":0},{"$f":"IF($BO109>0,$AJ109,\"\")","v":""},""]
[null,null,null,null,null,null,null,null,null,null,null,null,null,null,null,null,null,null,null,null,null,null,null,null,null,null,"Point 1",{"$f":"IF(OR($F$25=\"\",$H84=\"\"),0,$AE$49-(($H84*$M$19)*$M$17))","v":0},{"$f":"IF(OR($AB$110=0,$AB110=\"\"),$C$13,($AF$49+(($AB110-$AE$49)*$AA$40))-($F$22/2))","v":0},null,null,"Log Interactions",null,null,65,0,"None",{"$f":"$AL$45+ABS(AJ110*$M$19*$M$17)","v":0},0,{"$f":"$AN$45+ABS(AJ110*$M$19*$M$17)","v":0},0,false,0,0,0,{"$f":"IF(OR($AS110=\"\",$AS110=0),\"\",IF(OR($AK110=\"Left Stream Bed\",$AK110=\"Right Stream Bed\"),$AS110,\"\"))","v":""},{"$f":"IF(OR($AS110=\"\",$AS110=0),\"\",IF(OR($AK110=\"Left Floodplain\",$AK110=\"Left Bank\",$AK110=\"Right Bank\",$AK110=\"Right Floodplain\"),$AS110,\"\"))","v":""},{"$f":"IF(OR($AP110<$AE$12,$AP110<=$AO110),0,IF($AO110>=$AE$12,$AP110-$AO110,$AP110-$AE$12))","v":0},0,0,0,0,0,0,0,0,{"$f":"$BD110*$AJ$46*ABS($M$17)","v":0},0,0,"",{"$f":"IF($BH110=\"\",\"\",IF($BH110>0,$AJ110,\"\"))","v":""},{"$f":"IF($BH110=\"\",\"\",IF(OR(($AO110-$AP110)<0,$AO$45>=$AE$8),0,($AO110-$AP110)))","v":""},"","",{"$f":"IF($BH110=\"\",\"\",IF(OR(($AM110-$AP110)<0,$AM110>=$AE$8),\"\",($AE$8-($AM110-(($F$22/2)/$M$19)))))","v":""},"",0,0,0,"",{"$f":"IF($AY110>0,$AJ110,\"\")","v":""}]
[null,null,null,null,null,null,null,null,null,null,null,null,null,null,null,null,null,null,null,null,null,null,null,null,null,null,"Point 2",{"$f":"IF($AB110=\"\",0,$AB110)","v":0},{"$f":"IF(OR($AB$110=0,$AC110=\"\"),$C$13,$AC110-4)","v":0},null,null,"xTS (ft)","yTS (ft)",null,66,0,"None",0,{"$f":"AM110+((AL111-AL110)*$AA$40)","v":0},0,{"$f":"AO110+((AN111-AN110)*$AA$40)","v":0},false,0,0,0,"","",0,0,0,0,0,0,0,0,0,0,0,0,"","","","","","",{"$f":"IF($BM111=\"\",\"\",(((PI()^2)/32)*($B$66^-6)*EXP(-($BM111/$F$22)/(2*($B$66^2)))))","v":""},0,0,0,"",""]
[null,null,null,null,null,null,null,null,null,null,null,null,null,null,null,null,null,null,null,null,null,null,null,null,null,null,null,null,null,null,"Point 1",{"$f":"IF(OR($F$25=\"\",$C90=\"\"),0,($AE$49-(($C90*$M$19)*$M$17))+(ABS(2*$M$17*$M$19)))","v":0},{"$f":"IF(OR($AF112=\"\",$AF$105=0),$C$13,($AF$49+(($AF112-$AE$49)*$AA$40))+($F$22/2))","v":0},null,67,0,"None",0,0,0,0,false,0,0,0,"","",0,0,0,0,0,0,0,0,0,0,0,0,"","","","","","","",0,0,0,"",""]
[null,null,null,null,null,null,null,null,null,null,null,null,null,null,null,null,null,null,null,null,null,null,null,null,null,null,null,null,null,null,"Point 2",{"$f":"IF($AF112=\"\",0,$AF112)","v":0},{"$f":"IF(OR($AG112=\"\",$AF$105=0),$C$13,IF($AG$105>$AG$108,$AG112+2.25,$AG$108+2.25))","v":0},null,68,0,"None",0,0,0,0,false,0,0,0,"","",0,0,0,0,0,0,0,0,0,0,0,0,"","","","","","","",0,0,0,"",""]
[null,null,null,null,null,null,null,null,null,null,null,null,null,null,null,null,null,null,null,null,null,null,null,null,null,null,null,null,null,null,"Point 3",{"$f":"IF(OR($F$25=\"\",$C90=\"\"),0,($AE$49-(($C90*$M$19)*$M$17))-(ABS(2*$M$17*$M$19)))","v":0},{"$f":"IF(OR($AG113=\"\",$AF$105=0),$C$13,$AG113)","v":0},null,69,0,"None",0,0,0,0,false,0,0,0,"","",0,0,0,0,0,0,0,0,0,0,0,0,"","","","","","","",0,0,0,"",""]
[null,null,null,null,null,null,null,null,null,null,null,null,null,null,null,null,null,null,null,null,null,null,null,null,null,null,null,null,null,null,"Point 4",{"$f":"IF($AF112=\"\",0,$AF114)","v":0},{"$f":"IF(OR($AG112=\"\",$AF$105=0),$C$13,$AG112-((ABS($AF$105-$AF$108))*$AA$40))","v":0},null,70,0,"None",0,0,0,0,false,0,0,0,"","",0,0,0,0,0,0,0,0,0,0,0,0,"","","","","","","",0,0,0,"",""]
[null,null,null,null,null,null,null,null,null,null,null,null,null,null,null,null,null,null,null,null,null,null,null,null,null,null,null,null,null,null,null,null,null,null,71,0,"None",0,0,0,0,false,0,0,0,"","",0,0,0,0,0,0,0,0,0,0,0,0,"","","","","","","",0,0,0,"",""]
[null,null,null,null,null,null,null,null,null,null,null,null,null,null,null,null,null,null,null,null,null,null,null,null,null,null,null,null,null,null,null,null,null,null,72,0,"None",0,0,0,0,false,0,0,0,"","",0,0,0,0,0,0,0,0,0,0,0,0,"","","","","","","",0,0,0,"",""]
[null,null,null,null,null,null,null,null,null,null,null,null,null,null,null,null,null,null,null,null,null,null,null,null,null,null,null,null,null,null,null,null,null,null,73,0,"None",0,0,0,0,false,0,0,0,"","",0,0,0,0,0,0,0,0,0,0,0,0,"","","","","","","",0,0,0,"",""]
[null,null,null,null,null,null,null,null,null,null,null,null,null,null,null,null,null,null,null,null,null,null,null,null,null,null,null,null,null,null,null,null,null,null,74,0,"None",0,0,0,0,false,0,0,0,"","",0,0,0,0,0,0,0,0,0,0,0,0,"","","","","","","",0,0,0,"",""]
[null,null,null,null,null,null,null,null,null,null,null,null,null,null,null,null,null,null,null,null,null,null,null,null,null,null,null,null,null,null,null,null,null,null,75,0,"None",0,0,0,0,false,0,0,0,"","",0,0,0,0,0,0,0,0,0,0,0,0,"","","","","","","",0,0,0,"",""]
[null,null,null,null,null,null,null,null,null,null,null,null,null,null,null,null,null,null,null,null,null,null,null,null,null,null,null,null,null,null,null,null,null,null,76,0,"None",0,0,0,0,false,0,0,0,"","",0,0,0,0,0,0,0,0,0,0,0,0,"","","","","","","",0,0,0,"",""]
[null,null,null,null,null,null,null,null,null,null,null,null,null,null,null,null,null,null,null,null,null,null,null,null,null,null,null,null,null,null,null,null,null,null,77,0,"None",0,0,0,0,false,0,0,0,"","",0,0,0,0,0,0,0,0,0,0,0,0,"","","","","","","",0,0,0,"",""]
[null,null,null,null,null,null,null,null,null,null,null,null,null,null,null,null,null,null,null,null,null,null,null,null,null,null,null,null,null,null,null,null,null,null,78,0,"None",0,0,0,0,false,0,0,0,"","",0,0,0,0,0,0,0,0,0,0,0,0,"","","","","","","",0,0,0,"",""]
[null,null,null,null,null,null,null,null,null,null,null,null,null,null,null,null,null,null,null,null,null,null,null,null,null,null,null,null,null,null,null,null,null,null,79,0,"None",0,0,0,0,false,0,0,0,"","",0,0,0,0,0,0,0,0,0,0,0,0,"","","","","","","",0,0,0,"",""]
[null,null,null,null,null,null,null,null,null,null,null,null,null,null,null,null,null,null,null,null,null,null,null,null,null,null,null,null,null,null,null,null,null,null,80,0,"None",0,0,0,0,false,0,0,0,"","",0,0,0,0,0,0,0,0,0,0,0,0,"","","","","","","",0,0,0,"",""]
[null,null,null,null,null,null,null,null,null,null,null,null,null,null,null,null,null,null,null,null,null,null,null,null,null,null,null,null,null,null,null,null,null,null,81,0,"None",0,0,0,0,false,0,0,0,"","",0,0,0,0,0,0,0,0,0,0,0,0,"","","","","","","",0,0,0,"",""]
[null,null,null,null,null,null,null,null,null,null,null,null,null,null,null,null,null,null,null,null,null,null,null,null,null,null,null,null,null,null,null,null,null,null,82,0,"None",0,0,0,0,false,0,0,0,"","",0,0,0,0,0,0,0,0,0,0,0,0,"","","","","","","",0,0,0,"",""]
[null,null,null,null,null,null,null,null,null,null,null,null,null,null,null,null,null,null,null,null,null,null,null,null,null,null,null,null,null,null,null,null,null,null,83,0,"None",0,0,0,0,false,0,0,0,"","",0,0,0,0,0,0,0,0,0,0,0,0,"","","","","","","",0,0,0,"",""]
[null,null,null,null,null,null,null,null,null,null,null,null,null,null,null,null,null,null,null,null,null,null,null,null,null,null,null,null,null,null,null,null,null,null,84,0,"None",0,0,0,0,false,0,0,0,"","",0,0,0,0,0,0,0,0,0,0,0,0,"","","","","","","",0,0,0,"",""]
[null,null,null,null,null,null,null,null,null,null,null,null,null,null,null,null,null,null,null,null,null,null,null,null,null,null,null,null,null,null,null,null,null,null,85,0,"None",0,0,0,0,false,0,0,0,"","",0,0,0,0,0,0,0,0,0,0,0,0,"","","","","","","",0,0,0,"",""]
[null,null,null,null,null,null,null,null,null,null,null,null,null,null,null,null,null,null,null,null,null,null,null,null,null,null,null,null,null,null,null,null,null,null,86,0,"None",0,0,0,0,false,0,0,0,"","",0,0,0,0,0,0,0,0,0,0,0,0,"","","","","","","",0,0,0,"",""]
[null,null,null,null,null,null,null,null,null,null,null,null,null,null,null,null,null,null,null,null,null,null,null,null,null,null,null,null,null,null,null,null,null,null,87,0,"None",0,0,0,0,false,0,0,0,"","",0,0,0,0,0,0,0,0,0,0,0,0,"","","","","","","",0,0,0,"",""]
[null,null,null,null,null,null,null,null,null,null,null,null,null,null,null,null,null,null,null,null,null,null,null,null,null,null,null,null,null,null,null,null,null,null,88,0,"None",0,0,0,0,false,0,0,0,"","",0,0,0,0,0,0,0,0,0,0,0,0,"","","","","","","",0,0,0,"",""]
[null,null,null,null,null,null,null,null,null,null,null,null,null,null,null,null,null,null,null,null,null,null,null,null,null,null,null,null,null,null,null,null,null,null,89,0,"None",0,0,0,0,false,0,0,0,"","",0,0,0,0,0,0,0,0,0,0,0,0,"","","","","","","",0,0,0,"",""]
[null,null,null,null,null,null,null,null,null,null,null,null,null,null,null,null,null,null,null,null,null,null,null,null,null,null,null,null,null,null,null,null,null,null,90,0,"None",0,0,0,0,false,0,0,0,"","",0,0,0,0,0,0,0,0,0,0,0,0,"","","","","","","",0,0,0,"",""]
[null,null,null,null,null,null,null,null,null,null,null,null,null,null,null,null,null,null,null,null,null,null,null,null,null,null,null,null,null,null,null,null,null,null,91,0,"None",0,0,0,0,false,0,0,0,"","",0,0,0,0,0,0,0,0,0,0,0,0,"","","","","","","",0,0,0,"",""]
[null,null,null,null,null,null,null,null,null,null,null,null,null,null,null,null,null,null,null,null,null,null,null,null,null,null,null,null,null,null,null,null,null,null,92,0,"None",0,0,0,0,false,0,0,0,"","",0,0,0,0,0,0,0,0,0,0,0,0,"","","","","","","",0,0,0,"",""]
[null,null,null,null,null,null,null,null,null,null,null,null,null,null,null,null,null,null,null,null,null,null,null,null,null,null,null,null,null,null,null,null,null,null,93,0,"None",0,0,0,0,false,0,0,0,"","",0,0,0,0,0,0,0,0,0,0,0,0,"","","","","","","",0,0,0,"",""]
[null,null,null,null,null,null,null,null,null,null,null,null,null,null,null,null,null,null,null,null,null,null,null,null,null,null,null,null,null,null,null,null,null,null,94,0,"None",0,0,0,0,false,0,0,0,"","",0,0,0,0,0,0,0,0,0,0,0,0,"","","","","","","",0,0,0,"",""]
[null,null,null,null,null,null,null,null,null,null,null,null,null,null,null,null,null,null,null,null,null,null,null,null,null,null,null,null,null,null,null,null,null,null,95,0,"None",0,0,0,0,false,0,0,0,"","",0,0,0,0,0,0,0,0,0,0,0,0,"","","","","","","",0,0,0,"",""]
[null,null,null,null,null,null,null,null,null,null,null,null,null,null,null,null,null,null,null,null,null,null,null,null,null,null,null,null,null,null,null,null,null,null,96,0,"None",0,0,0,0,false,0,0,0,"","",0,0,0,0,0,0,0,0,0,0,0,0,"","","","","","","",0,0,0,"",""]
[null,null,null,null,null,null,null,null,null,null,null,null,null,null,null,null,null,null,null,null,null,null,null,null,null,null,null,null,null,null,null,null,null,null,97,0,"None",{"$f":"$AL$45+ABS(AJ142*$M$19*$M$17)","v":0},0,{"$f":"$AN$45+ABS(AJ142*$M$19*$M$17)","v":0},0,false,0,0,0,"","",0,0,0,0,0,0,0,0,0,0,0,0,"","","","","","","",0,0,0,"",""]
[null,null,null,null,null,null,null,null,null,null,null,null,null,null,null,null,null,null,null,null,null,null,null,null,null,null,null,null,null,null,null,null,null,null,98,0,"None",0,0,0,0,false,0,0,0,"","",0,0,0,0,0,0,0,0,0,0,0,0,"","","","","","","",0,0,0,"",""]
[null,null,null,null,null,null,null,null,null,null,null,null,null,null,null,null,null,null,null,null,null,null,null,null,null,null,null,null,null,null,null,null,null,null,99,0,"None",0,0,0,0,false,0,0,0,"","",0,0,0,0,0,0,0,0,0,0,0,0,"","","","","","","",0,0,0,"",""]
[null,null,null,null,null,null,null,null,null,null,null,null,null,null,null,null,null,null,null,null,null,null,null,null,null,null,null,null,null,null,null,null,null,null,100,0,"None",0,0,0,0,false,0,0,0,"","",0,0,0,0,0,0,0,0,0,0,0,0,"","","","","","","",0,0,0,"",""]
[null,null,null,null,null,null,null,null,null,null,null,null,null,null,null,null,null,null,null,null,null,null,null,null,null,null,null,null,null,null,null,null,null,null,101,0,"None",0,0,0,0,false,0,0,0,"","",0,0,0,0,0,0,0,0,0,0,0,0,"","","","","","","",0,0,0,"",""]
[null,null,null,null,null,null,null,null,null,null,null,null,null,null,null,null,null,null,null,null,null,null,null,null,null,null,null,null,null,null,null,null,null,null,102,0,"None",0,0,0,0,false,0,0,0,"","",0,0,0,0,0,0,0,0,0,0,0,0,"","","","","","","",0,0,0,"",""]
[null,null,null,null,null,null,null,null,null,null,null,null,null,null,null,null,null,null,null,null,null,null,null,null,null,null,null,null,null,null,null,null,null,null,103,0,"None",0,0,0,0,false,0,0,0,"","",0,0,0,0,0,0,0,0,0,0,0,0,"","","","","","","",0,0,0,"",""]
[null,null,null,null,null,null,null,null,null,null,null,null,null,null,null,null,null,null,null,null,null,null,null,null,null,null,null,null,null,null,null,null,null,null,104,0,"None",0,0,0,0,false,0,0,0,"","",0,0,0,0,0,0,0,0,0,0,0,0,"","","","","","","",0,0,0,"",""]
[null,null,null,null,null,null,null,null,null,null,null,null,null,null,null,null,null,null,null,null,null,null,null,null,null,null,null,null,null,null,null,null,null,null,105,0,"None",0,0,0,0,false,0,0,0,"","",0,0,0,0,0,0,0,0,0,0,0,0,"","","","","","","",0,0,0,"",""]
[null,null,null,null,null,null,null,null,null,null,null,null,null,null,null,null,null,null,null,null,null,null,null,null,null,null,null,null,null,null,null,null,null,null,106,0,"None",0,0,0,0,false,0,0,0,"","",0,0,0,0,0,0,0,0,0,0,0,0,"","","","","","","",0,0,0,"",""]
[null,null,null,null,null,null,null,null,null,null,null,null,null,null,null,null,null,null,null,null,null,null,null,null,null,null,null,null,null,null,null,null,null,null,107,0,"None",0,0,0,0,false,0,0,0,"","",0,0,0,0,0,0,0,0,0,0,0,0,"","","","","","","",0,0,0,"",""]
[null,null,null,null,null,null,null,null,null,null,null,null,null,null,null,null,null,null,null,null,null,null,null,null,null,null,null,null,null,null,null,null,null,null,108,0,"None",0,0,0,0,false,0,0,0,"","",0,0,0,0,0,0,0,0,0,0,0,0,"","","","","","","",0,0,0,"",""]
[null,null,null,null,null,null,null,null,null,null,null,null,null,null,null,null,null,null,null,null,null,null,null,null,null,null,null,null,null,null,null,null,null,null,109,0,"None",0,0,0,0,false,0,0,0,"","",0,0,0,0,0,0,0,0,0,0,0,0,"","","","","","","",0,0,0,"",""]
[null,null,null,null,null,null,null,null,null,null,null,null,null,null,null,null,null,null,null,null,null,null,null,null,null,null,null,null,null,null,null,null,null,null,110,0,"None",0,0,0,0,false,0,0,0,"","",0,0,0,0,0,0,0,0,0,0,0,0,"","","","","","","",0,0,0,"",""]
[null,null,null,null,null,null,null,null,null,null,null,null,null,null,null,null,null,null,null,null,null,null,null,null,null,null,null,null,null,null,null,null,null,null,111,0,"None",0,0,0,0,false,0,0,0,"","",0,0,0,0,0,0,0,0,0,0,0,0,"","","","","","","",0,0,0,"",""]
[null,null,null,null,null,null,null,null,null,null,null,null,null,null,null,null,null,null,null,null,null,null,null,null,null,null,null,null,null,null,null,null,null,null,112,0,"None",0,0,0,0,false,0,0,0,"","",0,0,0,0,0,0,0,0,0,0,0,0,"","","","","","","",0,0,0,"",""]
[null,null,null,null,null,null,null,null,null,null,null,null,null,null,null,null,null,null,null,null,null,null,null,null,null,null,null,null,null,null,null,null,null,null,113,0,"None",0,0,0,0,false,0,0,0,"","",0,0,0,0,0,0,0,0,0,0,0,0,"","","","","","","",0,0,0,"",""]
[null,null,null,null,null,null,null,null,null,null,null,null,null,null,null,null,null,null,null,null,null,null,null,null,null,null,null,null,null,null,null,null,null,null,114,0,"None",0,0,0,0,false,0,0,0,"","",0,0,0,0,0,0,0,0,0,0,0,0,"","","","","","","",0,0,0,"",""]
[null,null,null,null,null,null,null,null,null,null,null,null,null,null,null,null,null,null,null,null,null,null,null,null,null,null,null,null,null,null,null,null,null,null,115,0,"None",0,0,0,0,false,0,0,0,"","",0,0,0,0,0,0,0,0,0,0,0,0,"","","","","","","",0,0,0,"",""]
[null,null,null,null,null,null,null,null,null,null,null,null,null,null,null,null,null,null,null,null,null,null,null,null,null,null,null,null,null,null,null,null,null,null,116,0,"None",0,0,0,0,false,0,0,0,"","",0,0,0,0,0,0,0,0,0,0,0,0,"","","","","","","",0,0,0,"",""]
[null,null,null,null,null,null,null,null,null,null,null,null,null,null,null,null,null,null,null,null,null,null,null,null,null,null,null,null,null,null,null,null,null,null,117,0,"None",0,0,0,0,false,0,0,0,"","",0,0,0,0,0,0,0,0,0,0,0,0,"","","","","","","",0,0,0,"",""]
[null,null,null,null,null,null,null,null,null,null,null,null,null,null,null,null,null,null,null,null,null,null,null,null,null,null,null,null,null,null,null,null,null,null,118,0,"None",0,0,0,0,false,0,0,0,"","",0,0,0,0,0,0,0,0,0,0,0,0,"","","","","","","",0,0,0,"",""]
[null,null,null,null,null,null,null,null,null,null,null,null,null,null,null,null,null,null,null,null,null,null,null,null,null,null,null,null,null,null,null,null,null,null,119,0,"None",0,0,0,0,false,0,0,0,"","",0,0,0,0,0,0,0,0,0,0,0,0,"","","","","","","",0,0,0,"",""]
[null,null,null,null,null,null,null,null,null,null,null,null,null,null,null,null,null,null,null,null,null,null,null,null,null,null,null,null,null,null,null,null,null,null,120,0,"None",0,0,0,0,false,0,0,0,"","",0,0,0,0,0,0,0,0,0,0,0,0,"","","","","","","",0,0,0,"",""]
[null,null,null,null,null,null,null,null,null,null,null,null,null,null,null,null,null,null,null,null,null,null,null,null,null,null,null,null,null,null,null,null,null,null,121,0,"None",0,0,0,0,false,0,0,0,"","",0,0,0,0,0,0,0,0,0,0,0,0,"","","","","","","",0,0,0,"",""]
[null,null,null,null,null,null,null,null,null,null,null,null,null,null,null,null,null,null,null,null,null,null,null,null,null,null,null,null,null,null,null,null,null,null,122,0,"None",0,0,0,0,false,0,0,0,"","",0,0,0,0,0,0,0,0,0,0,0,0,"","","","","","","",0,0,0,"",""]
[null,null,null,null,null,null,null,null,null,null,null,null,null,null,null,null,null,null,null,null,null,null,null,null,null,null,null,null,null,null,null,null,null,null,123,0,"None",0,0,0,0,false,0,0,0,"","",0,0,0,0,0,0,0,0,0,0,0,0,"","","","","","","",0,0,0,"",""]
[null,null,null,null,null,null,null,null,null,null,null,null,null,null,null,null,null,null,null,null,null,null,null,null,null,null,null,null,null,null,null,null,null,null,124,0,"None",0,0,0,0,false,0,0,0,"","",0,0,0,0,0,0,0,0,0,0,0,0,"","","","","","","",0,0,0,"",""]
[null,null,null,null,null,null,null,null,null,null,null,null,null,null,null,null,null,null,null,null,null,null,null,null,null,null,null,null,null,null,null,null,null,null,125,0,"None",0,0,0,0,false,0,0,0,"","",0,0,0,0,0,0,0,0,0,0,0,0,"","","","","","","",0,0,0,"",""]
[null,null,null,null,null,null,null,null,null,null,null,null,null,null,null,null,null,null,null,null,null,null,null,null,null,null,null,null,null,null,null,null,null,null,126,0,"None",0,0,0,0,false,0,0,0,"","",0,0,0,0,0,0,0,0,0,0,0,0,"","","","","","","",0,0,0,"",""]
[null,null,null,null,null,null,null,null,null,null,null,null,null,null,null,null,null,null,null,null,null,null,null,null,null,null,null,null,null,null,null,null,null,null,127,0,"None",0,0,0,0,false,0,0,0,"","",0,0,0,0,0,0,0,0,0,0,0,0,"","","","","","","",0,0,0,"",""]
[null,null,null,null,null,null,null,null,null,null,null,null,null,null,null,null,null,null,null,null,null,null,null,null,null,null,null,null,null,null,null,null,null,null,128,{"$f":"($AI173/$AI$245)*$AJ$245","v":0},{"$f":"IF(OR($C$19=\"\",$F$25=\"\",$G$25=\"\"),\"None\",IF(AL173<$B$14,\"Left Floodplain\",IF(AL173<$B$15,\"Left Bank\",IF(AL173<$B$16,\"Left Stream Bed\",IF(AL173<$B$17,\"Right Stream Bed\",IF(AL173<$B$18,\"Right Bank\",\"Right Floodplain\"))))))","v":"None"},0,0,0,0,{"$f":"IF($AL173<$B$14,(($AL173-$B$13)*$AB$31)+$C$13,IF($AL173<$B$15,(($AL173-$B$14)*$AB$32)+$C$14,IF($AL173<$B$16,(($AL173-$B$15)*$AB$33)+$C$15,IF($AL173<$B$17,(($AL173-$B$16)*$AB$34)+$C$16,IF($AL173<$B$18,(($AL173-$B$17)*$AB$35)+$C$17,IF($AL173<$B$19,(($AL173-$B$18)*$AB$36)+$C$18))))))","v":false},{"$f":"IF(OR($AP173<$AE$12,$AP173<=$AM173),0,IF(OR($AP173>=$AE$12,$AM173>=$AE$12),$AP173-$AM173-$AR173,$AP173-$AE$12))","v":0},{"$f":"IF($AP173<=$AM173,0,IF($AM173>=$AE$12,0,IF($AP173<=$AE$12,$AP173-$AM173,$AE$12-$AM173)))","v":0},{"$f":"IF(AP173<=AM173,0,AP173-AM173)","v":0},"","",0,{"$f":"IF($AP173<=$AO173,0,IF($AO173>=$AE$12,0,IF($AP173<=$AE$12,$AP173-$AO173,$AE$12-$AO173)))","v":0},{"$f":"IF(AP173<=AO173,0,AP173-AO173)","v":0},{"$f":"IF($AS173=0,0,IF(OR($AJ173=0,$AJ173=$E$22),$AJ$46/2,$AJ$46))","v":0},{"$f":"IF(OR($AK173=\"Left Stream Bed\",$AK173=\"Right Stream Bed\"),$F$22*$AQ173*$AY173,0)","v":0},{"$f":"IF(OR($AK173=\"Left Stream Bed\",$AK173=\"Right Stream Bed\"),$F$22*$AR173*$AY173,0)","v":0},{"$f":"IF(OR($AK173=\"Left Floodplain\",$AK173=\"Left Bank\",$AK173=\"Right Bank\",$AK173=\"Right Floodplain\"),$F$22*$AQ173*$AY173,0)","v":0},{"$f":"IF(OR($AK173=\"Left Floodplain\",$AK173=\"Left Bank\",$AK173=\"Right Bank\",$AK173=\"Right Floodplain\"),$F$22*$AR173*$AY173,0)","v":0},{"$f":"AX173-AS173","v":0},0,{"$f":"AV173-AQ173","v":0},{"$f":"IF(OR($AJ173=0,$AJ173=$E$22),($BF173*$AJ$46/2)*ABS($M$17),$BF173*$AJ$46*ABS($M$17))","v":0},{"$f":"IF(OR($AM173<$AP173,$AO173>$AE$8),\"\",IF(OR($AJ173=0,$AJ173=$E$22),$AJ$46/2,$AJ$46))","v":""},"","",{"$f":"IF($BJ173=\"\",\"\",IF(OR($BJ173>($F$22/2),$BJ173=0),0,0.45-($BJ173*0.45/($F$22/2))))","v":""},{"$f":"IF($BK173=\"\",\"\",IF($BK173>0,$AJ173,\"\"))","v":""},"","",{"$f":"IF($AO173=0,0,IF($AO173>$AP173,0,IF(OR($AJ173=0,$AJ173=$E$22),$AJ$46/2,$AJ$46)))","v":0},{"$f":"IF(AND($BO173>0,OR($AK173=\"Left Stream Bed\",$AK173=\"Right Stream Bed\")),$BO173,0)","v":0},{"$f":"IF(AND($BO173>0,OR($AK173=\"Left Floodplain\",$AK173=\"Left Bank\",$AK173=\"Right Bank\",$AK173=\"Right Floodplain\")),$BO173,0)","v":0},{"$f":"IF($BO173>0,$AJ173,\"\")","v":""},""]
[null,null,null,null,null,null,null,null,null,null,null,null,null,null,null,null,null,null,null,null,null,null,null,null,null,null,null,null,null,null,null,null,null,null,129,0,"None",{"$f":"$AL$45+ABS(AJ174*$M$19*$M$17)","v":0},0,{"$f":"$AN$45+ABS(AJ174*$M$19*$M$17)","v":0},0,false,0,0,0,{"$f":"IF(OR($AS174=\"\",$AS174=0),\"\",IF(OR($AK174=\"Left Stream Bed\",$AK174=\"Right Stream Bed\"),$AS174,\"\"))","v":""},{"$f":"IF(OR($AS174=\"\",$AS174=0),\"\",IF(OR($AK174=\"Left Floodplain\",$AK174=\"Left Bank\",$AK174=\"Right Bank\",$AK174=\"Right Floodplain\"),$AS174,\"\"))","v":""},{"$f":"IF(OR($AP174<$AE$12,$AP174<=$AO174),0,IF($AO174>=$AE$12,$AP174-$AO174,$AP174-$AE$12))","v":0},0,0,0,0,0,0,0,0,{"$f":"$BD174*$AJ$46*ABS($M$17)","v":0},0,0,"",{"$f":"IF($BH174=\"\",\"\",IF($BH174>0,$AJ174,\"\"))","v":""},{"$f":"IF($BH174=\"\",\"\",IF(OR(($AO174-$AP174)<0,$AO$45>=$AE$8),0,($AO174-$AP174)))","v":""},"","",{"$f":"IF($BH174=\"\",\"\",IF(OR(($AM174-$AP174)<0,$AM174>=$AE$8),\"\",($AE$8-($AM174-(($F$22/2)/$M$19)))))","v":""},"",0,0,0,"",{"$f":"IF($AY174>0,$AJ174,\"\")","v":""}]
[null,null,null,null,null,null,null,null,null,null,null,null,null,null,null,null,null,null,null,null,null,null,null,null,null,null,null,null,null,null,null,null,null,null,130,0,"None",0,{"$f":"AM174+((AL175-AL174)*$AA$40)","v":0},0,{"$f":"AO174+((AN175-AN174)*$AA$40)","v":0},false,0,0,0,"","",0,0,0,0,0,0,0,0,0,0,0,0,"","","","","","",{"$f":"IF($BM175=\"\",\"\",(((PI()^2)/32)*($B$66^-6)*EXP(-($BM175/$F$22)/(2*($B$66^2)))))","v":""},0,0,0,"",""]
[null,null,null,null,null,null,null,null,null,null,null,null,null,null,null,null,null,null,null,null,null,null,null,null,null,null,null,null,null,null,null,null,null,null,131,0,"None",0,0,0,0,false,0,0,0,"","",0,0,0,0,0,0,0,0,0,0,0,0,"","","","","","","",0,0,0,"",""]
[null,null,null,null,null,null,null,null,null,null,null,null,null,null,null,null,null,null,null,null,null,null,null,null,null,null,null,null,null,null,null,null,null,null,132,0,"None",0,0,0,0,false,0,0,0,"","",0,0,0,0,0,0,0,0,0,0,0,0,"","","","","","","",0,0,0,"",""]
[null,null,null,null,null,null,null,null,null,null,null,null,null,null,null,null,null,null,null,null,null,null,null,null,null,null,null,null,null,null,null,null,null,null,133,0,"None",0,0,0,0,false,0,0,0,"","",0,0,0,0,0,0,0,0,0,0,0,0,"","","","","","","",0,0,0,"",""]
[null,null,null,null,null,null,null,null,null,null,null,null,null,null,null,null,null,null,null,null,null,null,null,null,null,null,null,null,null,null,null,null,null,null,134,0,"None",0,0,0,0,false,0,0,0,"","",0,0,0,0,0,0,0,0,0,0,0,0,"","","","","","","",0,0,0,"",""]
[null,null,null,null,null,null,null,null,null,null,null,null,null,null,null,null,null,null,null,null,null,null,null,null,null,null,null,null,null,null,null,null,null,null,135,0,"None",0,0,0,0,false,0,0,0,"","",0,0,0,0,0,0,0,0,0,0,0,0,"","","","","","","",0,0,0,"",""]
[null,null,null,null,null,null,null,null,null,null,null,null,null,null,null,null,null,null,null,null,null,null,null,null,null,null,null,null,null,null,null,null,null,null,136,0,"None",0,0,0,0,false,0,0,0,"","",0,0,0,0,0,0,0,0,0,0,0,0,"","","","","","","",0,0,0,"",""]
[null,null,null,null,null,null,null,null,null,null,null,null,null,null,null,null,null,null,null,null,null,null,null,null,null,null,null,null,null,null,null,null,null,null,137,0,"None",0,0,0,0,false,0,0,0,"","",0,0,0,0,0,0,0,0,0,0,0,0,"","","","","","","",0,0,0,"",""]
[null,null,null,null,null,null,null,null,null,null,null,null,null,null,null,null,null,null,null,null,null,null,null,null,null,null,null,null,null,null,null,null,null,null,138,0,"None",0,0,0,0,false,0,0,0,"","",0,0,0,0,0,0,0,0,0,0,0,0,"","","","","","","",0,0,0,"",""]
[null,null,null,null,null,null,null,null,null,null,null,null,null,null,null,null,null,null,null,null,null,null,null,null,null,null,null,null,null,null,null,null,null,null,139,0,"None",0,0,0,0,false,0,0,0,"","",0,0,0,0,0,0,0,0,0,0,0,0,"","","","","","","",0,0,0,"",""]
[null,null,null,null,null,null,null,null,null,null,null,null,null,null,null,null,null,null,null,null,null,null,null,null,null,null,null,null,null,null,null,null,null,null,140,0,"None",0,0,0,0,false,0,0,0,"","",0,0,0,0,0,0,0,0,0,0,0,0,"","","","","","","",0,0,0,"",""]
[null,null,null,null,null,null,null,null,null,null,null,null,null,null,null,null,null,null,null,null,null,null,null,null,null,null,null,null,null,null,null,null,null,null,141,0,"None",0,0,0,0,false,0,0,0,"","",0,0,0,0,0,0,0,0,0,0,0,0,"","","","","","","",0,0,0,"",""]
[null,null,null,null,null,null,null,null,null,null,null,null,null,null,null,null,null,null,null,null,null,null,null,null,null,null,null,null,null,null,null,null,null,null,142,0,"None",0,0,0,0,false,0,0,0,"","",0,0,0,0,0,0,0,0,0,0,0,0,"","","","","","","",0,0,0,"",""]
[null,null,null,null,null,null,null,null,null,null,null,null,null,null,null,null,null,null,null,null,null,null,null,null,null,null,null,null,null,null,null,null,null,null,143,0,"None",0,0,0,0,false,0,0,0,"","",0,0,0,0,0,0,0,0,0,0,0,0,"","","","","","","",0,0,0,"",""]
[null,null,null,null,null,null,null,null,null,null,null,null,null,null,null,null,null,null,null,null,null,null,null,null,null,null,null,null,null,null,null,null,null,null,144,0,"None",0,0,0,0,false,0,0,0,"","",0,0,0,0,0,0,0,0,0,0,0,0,"","","","","","","",0,0,0,"",""]
[null,null,null,null,null,null,null,null,null,null,null,null,null,null,null,null,null,null,null,null,null,null,null,null,null,null,null,null,null,null,null,null,null,null,145,0,"None",0,0,0,0,false,0,0,0,"","",0,0,0,0,0,0,0,0,0,0,0,0,"","","","","","","",0,0,0,"",""]
[null,null,null,null,null,null,null,null,null,null,null,null,null,null,null,null,null,null,null,null,null,null,null,null,null,null,null,null,null,null,null,null,null,null,146,0,"None",0,0,0,0,false,0,0,0,"","",0,0,0,0,0,0,0,0,0,0,0,0,"","","","","","","",0,0,0,"",""]
[null,null,null,null,null,null,null,null,null,null,null,null,null,null,null,null,null,null,null,null,null,null,null,null,null,null,null,null,null,null,null,null,null,null,147,0,"None",0,0,0,0,false,0,0,0,"","",0,0,0,0,0,0,0,0,0,0,0,0,"","","","","","","",0,0,0,"",""]
[null,null,null,null,null,null,null,null,null,null,null,null,null,null,null,null,null,null,null,null,null,null,null,null,null,null,null,null,null,null,null,null,null,null,148,0,"None",0,0,0,0,false,0,0,0,"","",0,0,0,0,0,0,0,0,0,0,0,0,"","","","","","","",0,0,0,"",""]
[null,null,null,null,null,null,null,null,null,null,null,null,null,null,null,null,null,null,null,null,null,null,null,null,null,null,null,null,null,null,null,null,null,null,149,0,"None",0,0,0,0,false,0,0,0,"","",0,0,0,0,0,0,0,0,0,0,0,0,"","","","","","","",0,0,0,"",""]
[null,null,null,null,null,null,null,null,null,null,null,null,null,null,null,null,null,null,null,null,null,null,null,null,null,null,null,null,null,null,null,null,null,null,150,0,"None",0,0,0,0,false,0,0,0,"","",0,0,0,0,0,0,0,0,0,0,0,0,"","","","","","","",0,0,0,"",""]
[null,null,null,null,null,null,null,null,null,null,null,null,null,null,null,null,null,null,null,null,null,null,null,null,null,null,null,null,null,null,null,null,null,null,151,0,"None",0,0,0,0,false,0,0,0,"","",0,0,0,0,0,0,0,0,0,0,0,0,"","","","","","","",0,0,0,"",""]
[null,null,null,null,null,null,null,null,null,null,null,null,null,null,null,null,null,null,null,null,null,null,null,null,null,null,null,null,null,null,null,null,null,null,152,0,"None",0,0,0,0,false,0,0,0,"","",0,0,0,0,0,0,0,0,0,0,0,0,"","","","","","","",0,0,0,"",""]
[null,null,null,null,null,null,null,null,null,null,null,null,null,null,null,null,null,null,null,null,null,null,null,null,null,null,null,null,null,null,null,null,null,null,153,0,"None",0,0,0,0,false,0,0,0,"","",0,0,0,0,0,0,0,0,0,0,0,0,"","","","","","","",0,0,0,"",""]
[null,null,null,null,null,null,null,null,null,null,null,null,null,null,null,null,null,null,null,null,null,null,null,null,null,null,null,null,null,null,null,null,null,null,154,0,"None",0,0,0,0,false,0,0,0,"","",0,0,0,0,0,0,0,0,0,0,0,0,"","","","","","","",0,0,0,"",""]
[null,null,null,null,null,null,null,null,null,null,null,null,null,null,null,null,null,null,null,null,null,null,null,null,null,null,null,null,null,null,null,null,null,null,155,0,"None",0,0,0,0,false,0,0,0,"","",0,0,0,0,0,0,0,0,0,0,0,0,"","","","","","","",0,0,0,"",""]
[null,null,null,null,null,null,null,null,null,null,null,null,null,null,null,null,null,null,null,null,null,null,null,null,null,null,null,null,null,null,null,null,null,null,156,0,"None",0,0,0,0,false,0,0,0,"","",0,0,0,0,0,0,0,0,0,0,0,0,"","","","","","","",0,0,0,"",""]
[null,null,null,null,null,null,null,null,null,null,null,null,null,null,null,null,null,null,null,null,null,null,null,null,null,null,null,null,null,null,null,null,null,null,157,0,"None",0,0,0,0,false,0,0,0,"","",0,0,0,0,0,0,0,0,0,0,0,0,"","","","","","","",0,0,0,"",""]
[null,null,null,null,null,null,null,null,null,null,null,null,null,null,null,null,null,null,null,null,null,null,null,null,null,null,null,null,null,null,null,null,null,null,158,0,"None",0,0,0,0,false,0,0,0,"","",0,0,0,0,0,0,0,0,0,0,0,0,"","","","","","","",0,0,0,"",""]
[null,null,null,null,null,null,null,null,null,null,null,null,null,null,null,null,null,null,null,null,null,null,null,null,null,null,null,null,null,null,null,null,null,null,159,0,"None",0,0,0,0,false,0,0,0,"","",0,0,0,0,0,0,0,0,0,0,0,0,"","","","","","","",0,0,0,"",""]
[null,null,null,null,null,null,null,null,null,null,null,null,null,null,null,null,null,null,null,null,null,null,null,null,null,null,null,null,null,null,null,null,null,null,160,0,"None",0,0,0,0,false,0,0,0,"","",0,0,0,0,0,0,0,0,0,0,0,0,"","","","","","","",0,0,0,"",""]
[null,null,null,null,null,null,null,null,null,null,null,null,null,null,null,null,null,null,null,null,null,null,null,null,null,null,null,null,null,null,null,null,null,null,161,0,"None",{"$f":"$AL$45+ABS(AJ206*$M$19*$M$17)","v":0},0,{"$f":"$AN$45+ABS(AJ206*$M$19*$M$17)","v":0},0,false,0,0,0,"","",0,0,0,0,0,0,0,0,0,0,0,0,"","","","","","","",0,0,0,"",""]
[null,null,null,null,null,null,null,null,null,null,null,null,null,null,null,null,null,null,null,null,null,null,null,null,null,null,null,null,null,null,null,null,null,null,162,0,"None",0,0,0,0,false,0,0,0,"","",0,0,0,0,0,0,0,0,0,0,0,0,"","","","","","","",0,0,0,"",""]
[null,null,null,null,null,null,null,null,null,null,null,null,null,null,null,null,null,null,null,null,null,null,null,null,null,null,null,null,null,null,null,null,null,null,163,0,"None",0,0,0,0,false,0,0,0,"","",0,0,0,0,0,0,0,0,0,0,0,0,"","","","","","","",0,0,0,"",""]
[null,null,null,null,null,null,null,null,null,null,null,null,null,null,null,null,null,null,null,null,null,null,null,null,null,null,null,null,null,null,null,null,null,null,164,0,"None",0,0,0,0,false,0,0,0,"","",0,0,0,0,0,0,0,0,0,0,0,0,"","","","","","","",0,0,0,"",""]
[null,null,null,null,null,null,null,null,null,null,null,null,null,null,null,null,null,null,null,null,null,null,null,null,null,null,null,null,null,null,null,null,null,null,165,0,"None",0,0,0,0,false,0,0,0,"","",0,0,0,0,0,0,0,0,0,0,0,0,"","","","","","","",0,0,0,"",""]
[null,null,null,null,null,null,null,null,null,null,null,null,null,null,null,null,null,null,null,null,null,null,null,null,null,null,null,null,null,null,null,null,null,null,166,0,"None",0,0,0,0,false,0,0,0,"","",0,0,0,0,0,0,0,0,0,0,0,0,"","","","","","","",0,0,0,"",""]
[null,null,null,null,null,null,null,null,null,null,null,null,null,null,null,null,null,null,null,null,null,null,null,null,null,null,null,null,null,null,null,null,null,null,167,0,"None",0,0,0,0,false,0,0,0,"","",0,0,0,0,0,0,0,0,0,0,0,0,"","","","","","","",0,0,0,"",""]
[null,null,null,null,null,null,null,null,null,null,null,null,null,null,null,null,null,null,null,null,null,null,null,null,null,null,null,null,null,null,null,null,null,null,168,0,"None",0,0,0,0,false,0,0,0,"","",0,0,0,0,0,0,0,0,0,0,0,0,"","","","","","","",0,0,0,"",""]
[null,null,null,null,null,null,null,null,null,null,null,null,null,null,null,null,null,null,null,null,null,null,null,null,null,null,null,null,null,null,null,null,null,null,169,0,"None",0,0,0,0,false,0,0,0,"","",0,0,0,0,0,0,0,0,0,0,0,0,"","","","","","","",0,0,0,"",""]
[null,null,null,null,null,null,null,null,null,null,null,null,null,null,null,null,null,null,null,null,null,null,null,null,null,null,null,null,null,null,null,null,null,null,170,0,"None",0,0,0,0,false,0,0,0,"","",0,0,0,0,0,0,0,0,0,0,0,0,"","","","","","","",0,0,0,"",""]
[null,null,null,null,null,null,null,null,null,null,null,null,null,null,null,null,null,null,null,null,null,null,null,null,null,null,null,null,null,null,null,null,null,null,171,0,"None",0,0,0,0,false,0,0,0,"","",0,0,0,0,0,0,0,0,0,0,0,0,"","","","","","","",0,0,0,"",""]
[null,null,null,null,null,null,null,null,null,null,null,null,null,null,null,null,null,null,null,null,null,null,null,null,null,null,null,null,null,null,null,null,null,null,172,0,"None",0,0,0,0,false,0,0,0,"","",0,0,0,0,0,0,0,0,0,0,0,0,"","","","","","","",0,0,0,"",""]
[null,null,null,null,null,null,null,null,null,null,null,null,null,null,null,null,null,null,null,null,null,null,null,null,null,null,null,null,null,null,null,null,null,null,173,0,"None",0,0,0,0,false,0,0,0,"","",0,0,0,0,0,0,0,0,0,0,0,0,"","","","","","","",0,0,0,"",""]
[null,null,null,null,null,null,null,null,null,null,null,null,null,null,null,null,null,null,null,null,null,null,null,null,null,null,null,null,null,null,null,null,null,null,174,0,"None",0,0,0,0,false,0,0,0,"","",0,0,0,0,0,0,0,0,0,0,0,0,"","","","","","","",0,0,0,"",""]
[null,null,null,null,null,null,null,null,null,null,null,null,null,null,null,null,null,null,null,null,null,null,null,null,null,null,null,null,null,null,null,null,null,null,175,0,"None",0,0,0,0,false,0,0,0,"","",0,0,0,0,0,0,0,0,0,0,0,0,"","","","","","","",0,0,0,"",""]
[null,null,null,null,null,null,null,null,null,null,null,null,null,null,null,null,null,null,null,null,null,null,null,null,null,null,null,null,null,null,null,null,null,null,176,0,"None",0,0,0,0,false,0,0,0,"","",0,0,0,0,0,0,0,0,0,0,0,0,"","","","","","","",0,0,0,"",""]
[null,null,null,null,null,null,null,null,null,null,null,null,null,null,null,null,null,null,null,null,null,null,null,null,null,null,null,null,null,null,null,null,null,null,177,0,"None",0,0,0,0,false,0,0,0,"","",0,0,0,0,0,0,0,0,0,0,0,0,"","","","","","","",0,0,0,"",""]
[null,null,null,null,null,null,null,null,null,null,null,null,null,null,null,null,null,null,null,null,null,null,null,null,null,null,null,null,null,null,null,null,null,null,178,0,"None",0,0,0,0,false,0,0,0,"","",0,0,0,0,0,0,0,0,0,0,0,0,"","","","","","","",0,0,0,"",""]
[null,null,null,null,null,null,null,null,null,null,null,null,null,null,null,null,null,null,null,null,null,null,null,null,null,null,null,null,null,null,null,null,null,null,179,0,"None",0,0,0,0,false,0,0,0,"","",0,0,0,0,0,0,0,0,0,0,0,0,"","","","","","","",0,0,0,"",""]
[null,null,null,null,null,null,null,null,null,null,null,null,null,null,null,null,null,null,null,null,null,null,null,null,null,null,null,null,null,null,null,null,null,null,180,0,"None",0,0,0,0,false,0,0,0,"","",0,0,0,0,0,0,0,0,0,0,0,0,"","","","","","","",0,0,0,"",""]
[null,null,null,null,null,null,null,null,null,null,null,null,null,null,null,null,null,null,null,null,null,null,null,null,null,null,null,null,null,null,null,null,null,null,181,0,"None",0,0,0,0,false,0,0,0,"","",0,0,0,0,0,0,0,0,0,0,0,0,"","","","","","","",0,0,0,"",""]
[null,null,null,null,null,null,null,null,null,null,null,null,null,null,null,null,null,null,null,null,null,null,null,null,null,null,null,null,null,null,null,null,null,null,182,0,"None",0,0,0,0,false,0,0,0,"","",0,0,0,0,0,0,0,0,0,0,0,0,"","","","","","","",0,0,0,"",""]
[null,null,null,null,null,null,null,null,null,null,null,null,null,null,null,null,null,null,null,null,null,null,null,null,null,null,null,null,null,null,null,null,null,null,183,0,"None",0,0,0,0,false,0,0,0,"","",0,0,0,0,0,0,0,0,0,0,0,0,"","","","","","","",0,0,0,"",""]
[null,null,null,null,null,null,null,null,null,null,null,null,null,null,null,null,null,null,null,null,null,null,null,null,null,null,null,null,null,null,null,null,null,null,184,0,"None",0,0,0,0,false,0,0,0,"","",0,0,0,0,0,0,0,0,0,0,0,0,"","","","","","","",0,0,0,"",""]
[null,null,null,null,null,null,null,null,null,null,null,null,null,null,null,null,null,null,null,null,null,null,null,null,null,null,null,null,null,null,null,null,null,null,185,0,"None",0,0,0,0,false,0,0,0,"","",0,0,0,0,0,0,0,0,0,0,0,0,"","","","","","","",0,0,0,"",""]
[null,null,null,null,null,null,null,null,null,null,null,null,null,null,null,null,null,null,null,null,null,null,null,null,null,null,null,null,null,null,null,null,null,null,186,0,"None",0,0,0,0,false,0,0,0,"","",0,0,0,0,0,0,0,0,0,0,0,0,"","","","","","","",0,0,0,"",""]
[null,null,null,null,null,null,null,null,null,null,null,null,null,null,null,null,null,null,null,null,null,null,null,null,null,null,null,null,null,null,null,null,null,null,187,0,"None",0,0,0,0,false,0,0,0,"","",0,0,0,0,0,0,0,0,0,0,0,0,"","","","","","","",0,0,0,"",""]
[null,null,null,null,null,null,null,null,null,null,null,null,null,null,null,null,null,null,null,null,null,null,null,null,null,null,null,null,null,null,null,null,null,null,188,0,"None",0,0,0,0,false,0,0,0,"","",0,0,0,0,0,0,0,0,0,0,0,0,"","","","","","","",0,0,0,"",""]
[null,null,null,null,null,null,null,null,null,null,null,null,null,null,null,null,null,null,null,null,null,null,null,null,null,null,null,null,null,null,null,null,null,null,189,0,"None",0,0,0,0,false,0,0,0,"","",0,0,0,0,0,0,0,0,0,0,0,0,"","","","","","","",0,0,0,"",""]
[null,null,null,null,null,null,null,null,null,null,null,null,null,null,null,null,null,null,null,null,null,null,null,null,null,null,null,null,null,null,null,null,null,null,190,0,"None",0,0,0,0,false,0,0,0,"","",0,0,0,0,0,0,0,0,0,0,0,0,"","","","","","","",0,0,0,"",""]
[null,null,null,null,null,null,null,null,null,null,null,null,null,null,null,null,null,null,null,null,null,null,null,null,null,null,null,null,null,null,null,null,null,null,191,0,"None",0,0,0,0,false,0,0,0,"","",0,0,0,0,0,0,0,0,0,0,0,0,"","","","","","","",0,0,0,"",""]
[null,null,null,null,null,null,null,null,null,null,null,null,null,null,null,null,null,null,null,null,null,null,null,null,null,null,null,null,null,null,null,null,null,null,192,{"$f":"($AI237/$AI$245)*$AJ$245","v":0},{"$f":"IF(OR($C$19=\"\",$F$25=\"\",$G$25=\"\"),\"None\",IF(AL237<$B$14,\"Left Floodplain\",IF(AL237<$B$15,\"Left Bank\",IF(AL237<$B$16,\"Left Stream Bed\",IF(AL237<$B$17,\"Right Stream Bed\",IF(AL237<$B$18,\"Right Bank\",\"Right Floodplain\"))))))","v":"None"},0,0,0,0,{"$f":"IF($AL237<$B$14,(($AL237-$B$13)*$AB$31)+$C$13,IF($AL237<$B$15,(($AL237-$B$14)*$AB$32)+$C$14,IF($AL237<$B$16,(($AL237-$B$15)*$AB$33)+$C$15,IF($AL237<$B$17,(($AL237-$B$16)*$AB$34)+$C$16,IF($AL237<$B$18,(($AL237-$B$17)*$AB$35)+$C$17,IF($AL237<$B$19,(($AL237-$B$18)*$AB$36)+$C$18))))))","v":false},{"$f":"IF(OR($AP237<$AE$12,$AP237<=$AM237),0,IF(OR($AP237>=$AE$12,$AM237>=$AE$12),$AP237-$AM237-$AR237,$AP237-$AE$12))","v":0},{"$f":"IF($AP237<=$AM237,0,IF($AM237>=$AE$12,0,IF($AP237<=$AE$12,$AP237-$AM237,$AE$12-$AM237)))","v":0},{"$f":"IF(AP237<=AM237,0,AP237-AM237)","v":0},"","",0,{"$f":"IF($AP237<=$AO237,0,IF($AO237>=$AE$12,0,IF($AP237<=$AE$12,$AP237-$AO237,$AE$12-$AO237)))","v":0},{"$f":"IF(AP237<=AO237,0,AP237-AO237)","v":0},{"$f":"IF($AS237=0,0,IF(OR($AJ237=0,$AJ237=$E$22),$AJ$46/2,$AJ$46))","v":0},{"$f":"IF(OR($AK237=\"Left Stream Bed\",$AK237=\"Right Stream Bed\"),$F$22*$AQ237*$AY237,0)","v":0},{"$f":"IF(OR($AK237=\"Left Stream Bed\",$AK237=\"Right Stream Bed\"),$F$22*$AR237*$AY237,0)","v":0},{"$f":"IF(OR($AK237=\"Left Floodplain\",$AK237=\"Left Bank\",$AK237=\"Right Bank\",$AK237=\"Right Floodplain\"),$F$22*$AQ237*$AY237,0)","v":0},{"$f":"IF(OR($AK237=\"Left Floodplain\",$AK237=\"Left Bank\",$AK237=\"Right Bank\",$AK237=\"Right Floodplain\"),$F$22*$AR237*$AY237,0)","v":0},{"$f":"AX237-AS237","v":0},0,{"$f":"AV237-AQ237","v":0},{"$f":"IF(OR($AJ237=0,$AJ237=$E$22),($BF237*$AJ$46/2)*ABS($M$17),$BF237*$AJ$46*ABS($M$17))","v":0},{"$f":"IF(OR($AM237<$AP237,$AO237>$AE$8),\"\",IF(OR($AJ237=0,$AJ237=$E$22),$AJ$46/2,$AJ$46))","v":""},"","",{"$f":"IF($BJ237=\"\",\"\",IF(OR($BJ237>($F$22/2),$BJ237=0),0,0.45-($BJ237*0.45/($F$22/2))))","v":""},{"$f":"IF($BK237=\"\",\"\",IF($BK237>0,$AJ237,\"\"))","v":""},"","",{"$f":"IF($AO237=0,0,IF($AO237>$AP237,0,IF(OR($AJ237=0,$AJ237=$E$22),$AJ$46/2,$AJ$46)))","v":0},{"$f":"IF(AND($BO237>0,OR($AK237=\"Left Stream Bed\",$AK237=\"Right Stream Bed\")),$BO237,0)","v":0},{"$f":"IF(AND($BO237>0,OR($AK237=\"Left Floodplain\",$AK237=\"Left Bank\",$AK237=\"Right Bank\",$AK237=\"Right Floodplain\")),$BO237,0)","v":0},{"$f":"IF($BO237>0,$AJ237,\"\")","v":""},""]
[null,null,null,null,null,null,null,null,null,null,null,null,null,null,null,null,null,null,null,null,null,null,null,null,null,null,null,null,null,null,null,null,null,null,193,0,"None",{"$f":"$AL$45+ABS(AJ238*$M$19*$M$17)","v":0},0,{"$f":"$AN$45+ABS(AJ238*$M$19*$M$17)","v":0},0,false,0,0,0,{"$f":"IF(OR($AS238=\"\",$AS238=0),\"\",IF(OR($AK238=\"Left Stream Bed\",$AK238=\"Right Stream Bed\"),$AS238,\"\"))","v":""},{"$f":"IF(OR($AS238=\"\",$AS238=0),\"\",IF(OR($AK238=\"Left Floodplain\",$AK238=\"Left Bank\",$AK238=\"Right Bank\",$AK238=\"Right Floodplain\"),$AS238,\"\"))","v":""},{"$f":"IF(OR($AP238<$AE$12,$AP238<=$AO238),0,IF($AO238>=$AE$12,$AP238-$AO238,$AP238-$AE$12))","v":0},0,0,0,0,0,0,0,0,{"$f":"$BD238*$AJ$46*ABS($M$17)","v":0},0,0,"",{"$f":"IF($BH238=\"\",\"\",IF($BH238>0,$AJ238,\"\"))","v":""},{"$f":"IF($BH238=\"\",\"\",IF(OR(($AO238-$AP238)<0,$AO$45>=$AE$8),0,($AO238-$AP238)))","v":""},"","",{"$f":"IF($BH238=\"\",\"\",IF(OR(($AM238-$AP238)<0,$AM238>=$AE$8),\"\",($AE$8-($AM238-(($F$22/2)/$M$19)))))","v":""},"",0,0,0,"",{"$f":"IF($AY238>0,$AJ238,\"\")","v":""}]
[null,null,null,null,null,null,null,null,null,null,null,null,null,null,null,null,null,null,null,null,null,null,null,null,null,null,null,null,null,null,null,null,null,null,194,{"$f":"($AI239/$AI$245)*$AJ$245","v":0},"None",0,{"$f":"AM238+((AL239-AL238)*$AA$40)","v":0},0,{"$f":"AO238+((AN239-AN238)*$AA$40)","v":0},false,0,0,0,"","",0,0,0,0,0,0,0,0,0,0,0,0,"","","","","","",{"$f":"IF($BM239=\"\",\"\",(((PI()^2)/32)*($B$66^-6)*EXP(-($BM239/$F$22)/(2*($B$66^2)))))","v":""},0,0,0,"",""]
[null,null,null,null,null,null,null,null,null,null,null,null,null,null,null,null,null,null,null,null,null,null,null,null,null,null,null,null,null,null,null,null,null,null,195,0,"None",0,0,0,0,false,0,0,0,"","",0,0,0,0,0,0,0,0,0,0,0,0,"","","","","","","",0,0,0,"",""]
[null,null,null,null,null,null,null,null,null,null,null,null,null,null,null,null,null,null,null,null,null,null,null,null,null,null,null,null,null,null,null,null,null,null,196,0,"None",0,0,0,0,false,0,0,0,"","",0,0,0,0,0,0,0,0,0,0,0,0,"","","","","","","",0,0,0,"",""]
[null,null,null,null,null,null,null,null,null,null,null,null,null,null,null,null,null,null,null,null,null,null,null,null,null,null,null,null,null,null,null,null,null,null,197,0,"None",0,0,0,0,false,0,0,0,"","",0,0,0,0,0,0,0,0,0,0,0,0,"","","","","","","",0,0,0,"",""]
[null,null,null,null,null,null,null,null,null,null,null,null,null,null,null,null,null,null,null,null,null,null,null,null,null,null,null,null,null,null,null,null,null,null,198,0,"None",0,0,0,0,false,0,0,0,"","",0,0,0,0,0,0,0,0,0,0,0,0,"","","","","","","",0,0,0,"",""]
[null,null,null,null,null,null,null,null,null,null,null,null,null,null,null,null,null,null,null,null,null,null,null,null,null,null,null,null,null,null,null,null,null,null,199,{"$f":"($AI244/$AI$245)*$AJ$245","v":0},"None",0,0,0,0,false,0,0,0,"","",0,0,0,0,0,0,0,0,0,0,0,0,"","","","","","","",0,0,0,"",""]
[null,null,null,null,null,null,null,null,null,null,null,null,null,null,null,null,null,null,null,null,null,null,null,null,null,null,null,null,null,null,null,null,null,null,200,{"$f":"$E$22","v":0},"None",0,0,0,0,false,0,0,0,"","",0,0,0,0,0,0,0,0,0,0,0,0,"","","","","","","",0,0,0,"",""]

{"sheet":"7-Notation","index":7,"n_rows":88,"n_cols":7,"rows_kept":88,"cut":false,"hidden":false,"merged":[[0,5,1,6]]}
[{"$f":"'1-Cover'!A1","v":"Project Name"}]
["Notation, Units, and List of Symbols"]
[]
["Notation",null,null,null,"Notation (continued)"]
["Symbol","Description","Unit",null,"Symbol","Description","Unit"]
["AW","Wetted area of channel at design discharge ","ft2",null,"FV","Resultant vertical force applied to log","lbf"]
["ATp","Projected area of wood in plane perpendicular to flow","ft2",null,"FrL","Log Froude number","-"]
["cD","Centroid of the drag force along log axis","ft",null,"FSV","Factor of Safety for Vertical Force Balance","-"]
["cAm","Centroid of a mechanical anchor along log axis","ft",null,"FSH","Factor of Safety for Horizontal Force Balance","-"]
["cAr","Centroid of a ballast boulder along log axis","ft",null,"FSM","Factor of Safety for Moment Force Balance","-"]
["cAsoil","Centroid of the added ballast soil along log axis","ft",null,"g","Gravitational acceleration constant","ft/s2"]
["cF&N","Centroid of friction and normal forces along log axis","ft",null,"KP","Coefficient of Passive Earth Pressure","-"]
["cL","Centroid of the lift force along log axis","ft",null,"LT,em","Total embedded length of log","ft"]
["cP","Centroid of the passive soil force along log axis","ft",null,"LRW","Assumed length of rootwad","ft"]
["csoil","Centroid of the vertical soil forces along log axis","ft",null,"LT","Total length of tree (including rootwad)","ft"]
["cT,B","Centroid of the buoyancy force along log axis","ft",null,"LTf","Length of log in contact with bed or banks","ft"]
["cT,W","Centroid of the log volume along log axis","ft",null,"LTS","Length of tree stem (not including rootwad)","ft"]
["cWI","Centroid of a wood interaction force along log axis","ft",null,"LTS,ex","Exposed length of tree stem","ft"]
["CLrock","Coefficient of lift for submerged boulder","-",null,"LFRW","Length factor for rootwad (LFRW = LRW/DTS)","-"]
["CLT","Effective coefficient of lift for submerged tree","-",null,"Md","Driving moment about embedded tip","lbf"]
["CDi","Base coefficient of drag for tree, before adjustments","-",null,"Mr","Driving moment about embedded tip","lbf"]
["CD*","Effective coefficient of drag for submerged tree","-",null,"N","Blow count of standard penetration test","-"]
["CDi","Base coefficient of drag for tree, before adjustments","-",null,"po","Porosity of soil volume","-"]
["CW","Wave drag coefficient of submerged tree","-",null,"Qdes","Design discharge","cfs"]
["db,avg","Average buried depth of log","ft",null,"R","Radius","ft"]
["db,max","Maximum buried depth of log","ft",null,"Rc","Radius of curvature at channel centerline","ft"]
["dw","Maximum flow depth at design discharge in reach","ft",null,"SGr","Specific gravity of quartz particles","-"]
["D50","Median grain size in millimeters (SI units)","mm",null,"SGT","Specific gravity of tree","-"]
["Dr","Equivalent diameter of boulder","ft",null,"uavg","Average velocity of cross section in reach","ft/s"]
["DRW","Assumed diameter of rootwad","ft",null,"udes","Design velocity","ft/s"]
["DTS","Nominal diameter of tree stem (DBH)","ft",null,"um","Adjusted velocity at outer meander bend","ft/s"]
["DFRW","Diameter factor for rootwad (DFRW = DRW/DTS)","-",null,"Vdry","Volume of soils above stage level of design flow","ft3"]
["e","Void ratio of soils","-",null,"Vsat","Volume of soils below stage level of design flow","ft3"]
["FA,H","Total horizontal load capacity of anchor techniques","lbf",null,"Vsoil","Total volume of soils over log","ft3"]
["FA,HP","Passive soil pressure applied to log from soil ballast","lbf",null,"VRW","Volume of rootwad","ft3"]
["FA,Hr","Horizontal resisting force on log from boulder","lbf",null,"VS","Volume of solids in soil (void ratio calculation)","ft3"]
["FAm","Load capacity of mechanical anchor","lbf",null,"VT","Total volume of log","ft3"]
["FA,V","Total vertical load capacity of anchor techniques","lbf",null,"VTS","Total volume of tree","ft3"]
["FA,Vr","Vertical resisting force on log from boulder","lbf",null,"VV","Volume of voids in soil","ft3"]
["FA,Vsoil","Vertical soil loading on log from added ballast soil","lbf",null,"VAdry","Volume of ballast above stage of design flow","ft3"]
["FB","Buoyant force applied to log","lbf",null,"VAwet","Volume of ballast below stage of design flow","ft3"]
["FD","Drag forces applied to log","lbf",null,"Vr,dry","Volume of boulder above stage of design flow","ft3"]
["FD,r","Drag forces applied to boulder","lbf",null,"Vr,wet","Volume of boulder below stage of design flow","ft3"]
["FF","Friction force applied to log","lbf",null,"WBF","Bankfull width at structure site","ft"]
["FH","Resultant horizontal force applied to log","lbf",null,"Wr","Effective weight of boulder","lbf"]
["FL","Lift force applied to log","lbf",null,"WT","Total log weight","lbf"]
["FL,r","Lift force applied to boulder","lbf",null,"x","Horizontal coordinate (distance)","ft"]
["FP","Passive soil pressure force applied to log","lbf",null,"y","Vertical coordinate (elevation)","ft"]
["Fsoil","Vertical soil loading on log","lbf",null,"yT,max","Minimum elevation of log","ft"]
["FW,H","Horizontal forces from interactions with other logs","lbf",null,"yT,min","Maximum elevation of log","ft"]
["FW,V","Vertical forces from interactions with other logs","lbf"]
[]
["Greek Symbols",null,null,null,"Abbreviations"]
["Symbol","Description","Unit",null,"Notation","Description"]
["b","Tilt angle from stem tip to vertical","deg",null,"ARI","Average return interval"]
["gbank","Dry specific weight of bank soils","lb/ft3",null,"Avg","Average"]
["gbank,sat","Saturated unit weight of bank soils","lb/ft3",null,"DBH","Diameter at breast height"]
["g'bank","Effective buoyant unit weight of bank soils","lb/ft3",null,"deg","Degrees"]
["gbed","Dry specific weight of stream bed substrate","lb/ft3",null,"Dia","Diameter"]
["g'bed","Effective buoyant unit weight of stream bed substrate","lb/ft3",null,"Dist","Distance"]
["grock","Dry unit weight of boulders","lb/ft3",null,"D/S","Downstream"]
["gs","Dry specific weight of soil","lb/ft3",null,"ELJ","Engineered log jam"]
["g's","Effective buoyant unit weight of soil","lb/ft3",null,"Ex","Example"]
["gTd","Air-dried unit weight of tree (12% MC basis)","lb/ft3",null,"Fldpln","Floodplain"]
["gTgr","Green unit weight of tree","lb/ft3",null,"H&H","Hydrologic and hydraulic"]
["gw","Specific weight of water at 50⁰F","lb/ft3",null,"ID","Identification"]
["h","Rootwad porosity","-",null,"i.e.","That is"]
["q","Rootwad (or large end of log) orientation to flow","deg",null,"LB","Left bank"]
["m","Coefficient of friction","-",null,"LW","Large wood"]
["n","Kinematic viscosity of water at 50⁰F","ft/s2",null,"Max","Maximum"]
["S","Sum of forces","-",null,"MC","Moisture content"]
["fbank","Internal friction angle of bank soils","deg",null,"Min","Minimum"]
["fbed","Internal friction angle of stream bed substrate","deg",null,"ML","Multi-log"]
[null,null,null,null,"SL","Single log"]
[null,null,null,null,"N/A","Not applicable"]
[null,null,null,null,"no","Number"]
["Units",null,null,null,"Pt","Point"]
["Notation","Description",null,null,"rad","Radians"]
["cfs","Cubic feet per second",null,null,"RB","Right bank"]
["ft","Feet",null,null,"RW","Rootwad"]
["lb","Pound",null,null,"SL","Single log"]
["lbf","Pounds force",null,null,"Thw","Thalweg (lowest elevation in channel bed)"]
["kg","Kilograms",null,null,"Typ","Typical"]
["m","Meters",null,null,"U.S.","United States"]
["mm","Millimeters",null,null,"WS","Water surface"]
["s","Seconds",null,null,"WSE","Water surface elevation"]
["yr","Year",null,null,"↑","Above"]
[null,null,null,null,"↓","Below"]

{"sheet":"Anchors","index":8,"n_rows":43,"n_cols":25,"rows_kept":43,"cut":false,"hidden":false,"merged":[[37,0,38,1],[39,0,40,1],[41,0,41,1],[28,0,29,0],[28,1,29,1],[26,0,27,0],[26,1,27,1],[33,0,34,1],[35,0,36,1],[2,17,2,21],[3,0,4,0],[30,0,31,0],[30,1,31,1],[2,22,2,24],[9,1,10,6],[15,1,17,6],[18,1,20,6],[2,3,2,5],[2,6,2,8],[2,9,2,12],[2,13,2,16],[3,1,4,1],[3,2,4,2]]}
["Reference Sheet - Anchoring Techniques"]
[]
["Anchor Technique Lookup Table (average holding capacities)",null,null,"Manta Ray",null,null,"Stingray",null,null,"Duckbill",null,null,null,"Platipus Stealth",null,null,null,"Platipus Bat",null,null,null,null,"Custom (User Selection)"]
["Soil Class","Soil Description","Blow Count (N)","MR-1","MR-2","MR-SR","SR-1","SR-2","SR-3","DB-40","DB-68","DB-88","DB-138","P-S02","P-S04","P-S06","P-S08","P-B04T","P-B06T","P-B08T","P-B10T","P-B12T","Custom#1","Custom#2","Custom#3"]
[null,null,null,"Capacity (lb)","Capacity (lb)","Capacity (lb)","Capacity (lb)","Capacity (lb)","Capacity (lb)","Capacity (lb)","Capacity (lb)","Capacity (lb)","Capacity (lb)","Capacity (lb)","Capacity (lb)","Capacity (lb)","Capacity (lb)","Capacity (lb)","Capacity (lb)","Capacity (lb)","Capacity (lb)","Capacity (lb)","Capacity (lb)","Capacity (lb)","Capacity (lb)"]
[4,"Dense gravels; gravel/cobble; very hard silts and clays","40-100+",24000,15000,32000,39000,62000,85000,"user input","user input","user input","user input",300,1000,3500,4500,6000,11000,16500,22000,33000,"(user input)","(user input)","(user input)"]
[5,"Dense coarse sand; gravel/sand; loose gravels; stiff slits and clays","14-40",15000,9000,18000,24000,31000,48000,300,1100,3000,5000,150,600,2000,2500,3500,6500,9000,14000,20000,"(user input)","(user input)","(user input)"]
[6,"Loose coarse sand; dense fine sand; firm silts and clays","7-14",10000,7000,14000,16000,27000,37000,"user input","user input","user input","user input",50,300,800,1500,2500,4000,6500,11000,16000,"(user input)","(user input)","(user input)"]
[7,"Loose fine sand; alluvium; soft silts and clays; silty sand","4-8",8000,5000,9000,13000,19000,24000,"user input","user input","user input","user input","N/A",200,400,1000,2000,3500,5500,9000,13000,"(user input)","(user input)","(user input)"]
["Notes:","1. All types -- Use this chart for estimation only. Values shown reflect the manufacturer's minimum expected holding capacity for a given condition. User is responsible for verifying load capacities. The true capacity must be tested by proof-loading. Minimum 2:1 Safety Factor is recommended. "]
[]
[null,"2. Installation may be difficult. Pilot hole may be required."]
[null,"3. Holding capacity limited by working load of anchors."]
[null,"4. Holding capacity limited by soil failure."]
[null,"5. Wide variation in soil properties reduces prediction accuracy. Pre-constructed field test recommended."]
[null,"6. Duckbill anchors are rated in an average (class 5) soil condition. Proof-loading is the only way to insure the exact capacity of each installation. Anchor holding capacity will vary in different soils. Increased capacities can be expected in harder soil classes (numerically higher blow count classifications) and lower capacity can be expected in the softer soil classes (numerically lower blow count). "]
[]
[]
[null,"7. Platipus Stealth and Bat anchors are given a wide range for holding capacities. The high manufacturer's rating was applied to class 4 soils, while the low value was assigned to class 7 soils. Holding capacities for class 5 and 6 soils were interpolated as a guide only. User is responsible for verifying all rating capacities."]
[]
[]
[]
[]
["Anchor/Ballast Technique Lookup Table"]
["Technique","Description"]
["Added Soil Ballast","Add coarse material soil lifts on top of structure to increase burial depth"]
["Boulder Ballast","Place boulder on top of structure.  Alternatively, secure structure to boulder located beside or beneath structure."]
[]
["Wood Pile               (In development)","Drive or bury vertical wood piles into the bed or banks to brace structure.  Alternatively, brace structure against existing large tree."]
[]
["Mechanical Anchor","Secure structure to soil anchor which uses overlying soil to resist pullout.  Alternatively, secure the structure to bedrock using a rock anchor."]
[]
[]
["Four common alternatives exist for securing or stabilizing placements of large wood in water. In order of preference for habitat formation, they are: "]
[]
["1. No added stability -- where wood is supplied to the stream and allowed to be stable without manipulation or, as conditions develop, moved by the flow. "]
[]
["2. Passive stability -- where the weight and shape of the structure is the anchor, and movement at some flow level is acceptable (includes ballast)."]
[]
["3. Flexible stability -- such as tethering the structure so some degree of movement is allowed with varying flows."]
[]
["4. Rigid stability -- holding the logs permanently in place with no movement allowed."]
["(Source: 2012 WA Stream Habitat Restoration Guidelines)"]